[38;5;4mℹ Using GPU: 0[0m
[1m
========================= Generating Prodigy config =========================[0m
[38;5;2m✔ Generated training config[0m
[1m
=========================== Initializing pipeline ===========================[0m
[38;5;2m✔ Initialized pipeline[0m
[1m
============================= Training pipeline =============================[0m
[38;5;4mℹ Pipeline: ['transformer', 'ner'][0m
[38;5;4mℹ Initial learn rate: 0.0[0m
E    #       LOSS TRANS...  LOSS NER  ENTS_F  ENTS_P  ENTS_R  SCORE 
---  ------  -------------  --------  ------  ------  ------  ------
  0       0        9029.46   1016.63    0.10    0.07    0.23    0.00
  3     200      393146.30  40171.03    6.41    6.49    6.32    0.06
  6     400      184689.82  30296.10    0.00    0.00    0.00    0.00
 10     600       11348.99  23529.65    0.00    0.00    0.00    0.00
 13     800       10364.28  22869.68    0.00    0.00    0.00    0.00
 16    1000        9772.94  22520.87    0.00    0.00    0.00    0.00
 20    1200        9486.50  22468.97    0.00    0.00    0.00    0.00
 23    1400        9025.20  21954.07    0.00    0.00    0.00    0.00
 26    1600        8784.85  22146.21    0.00    0.00    0.00    0.00
 29    1800        8438.39  21679.85    0.00    0.00    0.00    0.00
[38;5;2m✔ Saved pipeline to output directory[0m
../Models/yasuoka-8/model-last
[1m
=============================== NER (per type) ===============================[0m

                    P       R       F
secondary_cong   6.54   21.26   10.00
other_party      0.00    0.00    0.00
criminal         0.00    0.00    0.00

