[38;5;4mℹ Using GPU: 0[0m
[1m
========================= Generating Prodigy config =========================[0m
[38;5;2m✔ Generated training config[0m
[1m
=========================== Initializing pipeline ===========================[0m
[38;5;2m✔ Initialized pipeline[0m
[1m
============================= Training pipeline =============================[0m
[38;5;4mℹ Pipeline: ['tok2vec', 'ner'][0m
[38;5;4mℹ Initial learn rate: 0.001[0m
E    #       LOSS TOK2VEC  LOSS NER  ENTS_F  ENTS_P  ENTS_R  SCORE 
---  ------  ------------  --------  ------  ------  ------  ------
  0       0          0.00    141.71    0.00    0.00    0.00    0.00
  0     200       1449.85   5950.81   13.35   15.96   11.48    0.13
  1     400        219.20   3252.00   27.89   32.21   24.59    0.28
  1     600        266.05   2785.11   31.37   40.67   25.53    0.31
  2     800        289.73   2288.95   39.62   46.67   34.43    0.40
  3    1000        444.76   2543.04   32.56   42.91   26.23    0.33
  3    1200        446.63   2158.33   35.67   40.91   31.62    0.36
  4    1400        629.85   1872.98   36.80   40.17   33.96    0.37
  5    1600        801.86   1741.51   38.79   41.96   36.07    0.39
  5    1800        915.42   1911.80   37.15   43.67   32.32    0.37
  6    2000        858.95   1545.75   33.76   42.81   27.87    0.34
  7    2200        965.20   1658.57   31.77   44.87   24.59    0.32
  8    2400       1145.80   1738.50   36.27   41.32   32.32    0.36
[38;5;2m✔ Saved pipeline to output directory[0m
../Models/basic-5/model-last
[1m
=============================== NER (per type) ===============================[0m

                     P       R       F
criminal         54.07   48.34   51.05
other_party      41.11   49.66   44.98
secondary_cong    0.00    0.00    0.00

