[38;5;4mℹ Using GPU: 0[0m
[1m
========================= Generating Prodigy config =========================[0m
[38;5;2m✔ Generated training config[0m
[1m
=========================== Initializing pipeline ===========================[0m
[38;5;2m✔ Initialized pipeline[0m
[1m
============================= Training pipeline =============================[0m
[38;5;4mℹ Pipeline: ['transformer', 'ner'][0m
[38;5;4mℹ Initial learn rate: 0.0[0m
E    #       LOSS TRANS...  LOSS NER  ENTS_F  ENTS_P  ENTS_R  SCORE 
---  ------  -------------  --------  ------  ------  ------  ------
  0       0        9029.46   1016.63    0.10    0.07    0.23    0.00
  3     200      413277.54  40668.79    6.33    6.11    6.56    0.06
  6     400       83960.97  24252.47    9.01    9.68    8.43    0.09
 10     600       99960.57  24170.37    0.00    0.00    0.00    0.00
 13     800       10144.55  20761.53    0.00    0.00    0.00    0.00
 16    1000        9271.64  20659.15    0.00    0.00    0.00    0.00
 20    1200        9514.45  21438.28    0.00    0.00    0.00    0.00
 23    1400       13879.81  19900.12    0.00    0.00    0.00    0.00
 26    1600        7719.35  19020.76    0.00    0.00    0.00    0.00
 29    1800       21104.96  19694.35    0.00    0.00    0.00    0.00
 33    2000        7534.88  21266.92    0.00    0.00    0.00    0.00
[38;5;2m✔ Saved pipeline to output directory[0m
../Models/yasuoka-13/model-last
[1m
=============================== NER (per type) ===============================[0m

                    P       R       F
criminal         9.68   23.84   13.77
other_party      0.00    0.00    0.00
secondary_cong   0.00    0.00    0.00

