[38;5;4mℹ Using GPU: 0[0m
[1m
========================= Generating Prodigy config =========================[0m
[38;5;2m✔ Generated training config[0m
[1m
=========================== Initializing pipeline ===========================[0m
[38;5;2m✔ Initialized pipeline[0m
[1m
============================= Training pipeline =============================[0m
[38;5;4mℹ Pipeline: ['tok2vec', 'ner'][0m
[38;5;4mℹ Initial learn rate: 0.001[0m
E    #       LOSS TOK2VEC  LOSS NER  ENTS_F  ENTS_P  ENTS_R  SCORE 
---  ------  ------------  --------  ------  ------  ------  ------
  0       0          0.00    141.71    0.00    0.00    0.00    0.00
  0     200       3261.82   6904.44   14.37   18.02   11.94    0.14
  1     400        201.38   3338.75   20.98   23.48   18.97    0.21
  1     600        275.88   2740.10   30.09   33.72   27.17    0.30
  2     800        415.14   2351.80   33.08   36.21   30.44    0.33
  3    1000        446.44   2777.21   38.10   43.77   33.72    0.38
  3    1200        646.91   2449.27   45.19   47.78   42.86    0.45
  4    1400        576.98   2134.01   38.60   41.51   36.07    0.39
  5    1600        576.98   1857.93   39.46   41.12   37.94    0.39
  5    1800        766.19   1960.02   40.00   44.19   36.53    0.40
  6    2000        858.08   1779.12   41.26   49.51   35.36    0.41
  7    2200        810.74   1736.27   32.25   38.26   27.87    0.32
  8    2400       1330.14   1908.31   37.15   43.67   32.32    0.37
  8    2600       1094.13   1639.88   40.05   41.84   38.41    0.40
  9    2800       1464.13   1874.32   40.98   45.56   37.24    0.41
[38;5;2m✔ Saved pipeline to output directory[0m
../Models/vec_vectors-e100-d300-18/model-last
[1m
=============================== NER (per type) ===============================[0m

                     P       R       F
criminal         48.19   52.98   50.47
other_party      45.13   59.06   51.16
secondary_cong   68.18   11.81   20.13

