[38;5;4mℹ Using GPU: 0[0m
[1m
========================= Generating Prodigy config =========================[0m
[38;5;2m✔ Generated training config[0m
[1m
=========================== Initializing pipeline ===========================[0m
[38;5;2m✔ Initialized pipeline[0m
[1m
============================= Training pipeline =============================[0m
[38;5;4mℹ Pipeline: ['transformer', 'ner'][0m
[38;5;4mℹ Initial learn rate: 0.0[0m
E    #       LOSS TRANS...  LOSS NER  ENTS_F  ENTS_P  ENTS_R  SCORE 
---  ------  -------------  --------  ------  ------  ------  ------
  0       0        1577.04   1058.70    0.63    0.36    2.58    0.01
  3     200      847155.96  59314.12   22.97   23.75   22.25    0.23
  6     400      971810.69  49699.79   11.19   27.52    7.03    0.11
 10     600      141254.48  29603.98   30.59   30.73   30.44    0.31
 13     800       89645.76  23476.71   24.22   24.82   23.65    0.24
 16    1000      260967.41  28968.70    0.00    0.00    0.00    0.00
 20    1200       33333.79  18877.21   45.42   44.95   45.90    0.45
 23    1400       25035.36  18084.61   57.38   57.38   57.38    0.57
 26    1600        5462.75  11368.89   58.28   58.00   58.55    0.58
 29    1800        6048.35  10640.53   62.62   63.68   61.59    0.63
 33    2000        4783.02   8757.76   67.06   67.87   66.28    0.67
 36    2200       32019.76  12087.97   60.74   59.91   61.59    0.61
 40    2400        2670.71   6965.06   55.67   55.61   55.74    0.56
 43    2600        7287.13   6789.95   58.67   60.80   56.67    0.59
 46    2800         935.35   5235.83   61.32   60.83   61.83    0.61
 50    3000        2356.42   4538.80   63.21   65.17   61.36    0.63
 53    3200        2549.07   3990.52   63.33   62.96   63.70    0.63
 56    3400        1192.03   3422.90   64.12   65.29   63.00    0.64
 60    3600        1132.34   3028.43   69.49   69.91   69.09    0.69
 63    3800        5473.96   2659.62   64.62   65.08   64.17    0.65
 66    4000         965.22   2207.46   66.90   67.06   66.74    0.67
 70    4200       13427.13   1919.81   66.43   66.59   66.28    0.66
 73    4400        1225.24   1588.30   62.97   63.42   62.53    0.63
 76    4600        3180.30   1272.45   64.47   64.78   64.17    0.64
 80    4800         216.15    893.67   61.25   61.61   60.89    0.61
 83    5000        1147.92    838.68   65.64   66.43   64.87    0.66
 86    5200         275.27    581.88   60.05   60.62   59.48    0.60
[38;5;2m✔ Saved pipeline to output directory[0m
../Models/gujibert-12/model-last
[1m
=============================== NER (per type) ===============================[0m

                     P       R       F
criminal         76.92   72.85   74.83
other_party      66.28   76.51   71.03
secondary_cong   66.36   55.91   60.68

