file	id	title	subtitle	author-firstname1	author-lastname1	author-firstname2	author-lastname2	author-firstname3	author-lastname3	translator-firstname1	translator-lastname1	translator-firstname2	translator-lastname2	translator-firstname3	translator-lastname3	transcriber-firstname1	transcriber-lastname1	collection	resp_collection-firstname1	resp_collection-lastname1	resp_collection-firstname2	resp_collection-lastname2	resp_collection-firstname3	resp_collection-lastname3	words	publisher	pubPlace	date	licence	note	edition	sourceDesc	projectDesc	language	language_ori	dialecte	creationDate	derivation	domain1	domain2	domain3	genre1	genre2	genre3	textForm
1-MD2000_or_fr.xml	42	L’an 2000		Ignacio	Ramonet											Hélène	Chuquet	PLECI	Raluca	Nita	Michaël	Nauge			862	Le Monde Diplomatique		1999		Etats - Mondialisation		Aligné par Hélène Chuquet	Corpus PLECI: lien site FoReLLIS	fr	fr		2023	original	journalistique			éditorial			
1-MD2000_tr_en.xml	43	The year 2000		Ignacio	Ramonet											Hélène	Chuquet	PLECI	Raluca	Nita	Michaël	Nauge			889	Le Monde Diplomatique		1999		Etats - Mondialisation		Aligné par Hélène Chuquet	Corpus PLECI: lien site FoReLLIS		en		2023	traduction	journalistique			éditorial			
2-MD2000_or_fr.xml	44	Entre le Mexique et les Etats-Unis, plus qu’une frontière	Zones franches et rideau de fer	Janette 	Habel											Hélène	Chuquet	PLECI	Raluca	Nita	Michaël	Nauge			1969	Le Monde Diplomatique		1999		USA - Mexique		Aligné par Hélène Chuquet	Corpus PLECI: lien site FoReLLIS		fr		2023	original	journalistique			reportage			
2-MD2000_tr_en.xml	45	The line that divides Mexico and the US 	Free Trade across an iron curtain	Derry 	Cook-Radmore											Hélène	Chuquet	PLECI	Raluca	Nita	Michaël	Nauge			1952	Le Monde Diplomatique		1999		USA - Mexique		Aligné par Hélène Chuquet	Corpus PLECI: lien site FoReLLIS		en		2023	traduction	journalistique			reportage			
