word;file_id;line_id
budgeting;Jean-Claude_Martinez-14-Débats_-_Jeudi_3_juillet_2003_-_Votes.txt;8
budgeting;Jean-Claude_Martinez-14-Débats_-_Jeudi_3_juillet_2003_-_Votes.txt;11
budgeting;Jean-Claude_Martinez-14-Débats_-_Jeudi_3_juillet_2003_-_Votes.txt;12
budgeting;Jean-Claude_Martinez-14-Débats_-_Jeudi_3_juillet_2003_-_Votes.txt;13
