word;file_id;line_id
Estaing;Charles_de_Gaulle-2-Débats_-_Mardi_1_juillet_2003_-_Présiden.txt;6
Estaing;Charles_de_Gaulle-2-Débats_-_Mardi_1_juillet_2003_-_Présiden.txt;6
opting;Charles_de_Gaulle-2-Débats_-_Mardi_1_juillet_2003_-_Présiden.txt;12
