word;file_id;line_id
warning;Pervenche_Berès-50-Débats_-_Mardi_11_mars_2008_-_Suivi_aprè.txt;30
warning;Pervenche_Berès-50-Débats_-_Mardi_11_mars_2008_-_Suivi_aprè.txt;34
warning;Pervenche_Berès-50-Débats_-_Mardi_11_mars_2008_-_Suivi_aprè.txt;34
