Traduit en attente de révision;E1
Traduit en attente de révision;E2
Traduit en attente de révision;E3
Traduit en attente de révision;E4
Validé;E5
Validé;E6
Validé;E7
Traduit en attente de révision;E8
Validé;E9
En cours de traduction;E10
Validé;E11
En cours de révision;E12
Traduit en attente de révision;E13
Traduit en attente de révision;E14
En cours de révision;E15
Traduit en attente de révision;E16
Traduit en attente de révision;E17
Validé;E18
Validé;E19
Traduit en attente de révision;E20
En cours de révision;E21
Validé;E22
En cours de révision;E24
En cours de révision;E25
Traduit en attente de révision;E26
Traduit en attente de révision;E27
Traduit en attente de révision;E28
Traduit en attente de révision;E29
Validé;E30
Traduit en attente de révision;E31
Traduit en attente de révision;E32
En cours de traduction;E33
Traduit en attente de révision;E34
Traduit en attente de révision;E35
Traduit en attente de révision;E36
Traduit en attente de révision;E37
Validé;E39
Traduit en attente de révision;E41
A traduire;E42
Traduit en attente de révision;E52
Traduit en attente de révision;E53
A traduire;E54
Validé;E55
Validé;E56
Traduit en attente de révision;E57
Traduit en attente de révision;E58
A traduire;E59
A traduire;E60
A traduire;E61
A traduire;E62
En cours de traduction;E63
En cours de révision;E64
Validé;E65
A traduire;E66
Traduit en attente de révision;E67
Validé;E68
Validé;E69
En cours de révision;E70
Traduit en attente de révision;E71
A traduire;E72
A traduire;E73
En cours de révision;E74
Traduit en attente de révision;E77
Traduit en attente de révision;E78
Traduit en attente de révision;E79
En cours de traduction;E80
;E81
En cours de traduction;E83
A traduire;E85
A traduire;E86
Traduit en attente de révision;E87
Traduit en attente de révision;E89
A traduire;E90
A traduire;E92
A traduire;E93
En cours de traduction;E94
;E95
Traduit en attente de révision;E96
;E97
Traduit en attente de révision;E98
Traduit en attente de révision;E99
Traduit en attente de révision;P1
Traduit en attente de révision;P2
Traduit en attente de révision;P3
;P4
;P5
En cours de révision;P7
;P8
;P9
A traduire;P10
Validé;P11
En cours de révision;P12
A traduire;P13
Traduit en attente de révision;P14
Traduit en attente de révision;P15
Traduit en attente de révision;P16
Traduit en attente de révision;P17
Traduit en attente de révision;P19
Traduit en attente de révision;P20
Traduit en attente de révision;P21
Traduit en attente de révision;P22
Traduit en attente de révision;P23
Traduit en attente de révision;P24
Traduit en attente de révision;P25
Traduit en attente de révision;P26
Traduit en attente de révision;P27
Traduit en attente de révision;P28
Traduit en attente de révision;P29
Traduit en attente de révision;P30
Traduit en attente de révision;P31
Traduit en attente de révision;P32
Traduit en attente de révision;P33
Traduit en attente de révision;P34
Traduit en attente de révision;P35
Traduit en attente de révision;P37
Traduit en attente de révision;P38
Validé;P39
Traduit en attente de révision;P40
En cours de traduction;P41
En cours de traduction;P42
A traduire;P43
Validé;P44
Validé;P45
Validé;P46
;P48
Validé;P49
Validé;P50
Validé;P51
Validé;P52
Validé;P53
Validé;P54
Traduit en attente de révision;P55
Validé;P56
Validé;P57
Validé;P59
Traduit en attente de révision;P62
Traduit en attente de révision;P65
A traduire;P67
A traduire;P68
A traduire;P69
A traduire;P70
;P71
A traduire;P72
A traduire;P73
A traduire;P74
A traduire;P75
A traduire;P76
Validé;P79
Validé;P80
Traduit en attente de révision;P81
Traduit en attente de révision;P82
Traduit en attente de révision;P86
En cours de traduction;P89
;P90
;P91
;P92
A traduire;P93
En cours de traduction;P94
A traduire;P95
Traduit en attente de révision;P96
Traduit en attente de révision;P97
Traduit en attente de révision;P98
Validé;P99
Validé;P100
Traduit en attente de révision;P101
A traduire;P102
A traduire;P103
A traduire;P104
A traduire;P105
Validé;P106
;P107
;P108
Traduit en attente de révision;P109
;P110
;P111
;P112
;P113
En cours de traduction;P121
En cours de traduction;P122
;P123
;P124
Traduit en attente de révision;P125
Traduit en attente de révision;P126
Traduit en attente de révision;P127
Traduit en attente de révision;P128
A traduire;P129
A traduire;P130
En cours de traduction;P132
;P133
Traduit en attente de révision;P134
Traduit en attente de révision;P135
En cours de traduction;P136
;P137
A traduire;P138
A traduire;P139
Traduit en attente de révision;P140
Traduit en attente de révision;P141
Traduit en attente de révision;P142
A traduire;P143
A traduire;P144
A traduire;P145
A traduire;P146
A traduire;P147
A traduire;P148
Traduit en attente de révision;P150
A traduire;P151
;P152
Traduit en attente de révision;P156
Traduit en attente de révision;P157
;P160
;P161
A traduire;P164
A traduire;P165
A traduire;P166
A traduire;P167
En cours de traduction;P168
;P169
;P170
;P171
;P172
;P173
;P174
;P175
;P176
Traduit en attente de révision;P177
Traduit en attente de révision;P179
;P180
;P181
;P182
;P183
;P184
;P185
;P186
Traduit en attente de révision;P187
Traduit en attente de révision;P188
;P189
Traduit en attente de révision;P190
Traduit en attente de révision;P191
A traduire;P195
Traduit en attente de révision;P196
A traduire;P197
Validé;P198
