[
  {
    "objectID": "index.html",
    "href": "index.html",
    "title": "Analyse de réseau avec igraph",
    "section": "",
    "text": "Le package igraph\nigraph est un logiciel open source principalement écrit en langage C qui fournit des outils pour créer, manipuler, analyser et visualiser des graphes et des réseaux.\nLa première version a été publiée en 2002 par Gábor Csárdi et Tamás Nepusz, deux chercheurs en informatique hongrois. Depuis, igraph est devenu l’un des packages les plus populaires pour l’analyse de réseau, notamment car cette librairie peut être utilisée dans plusieurs langages de programmation comme Python, Julia et C++.\nGábor Csárdi a officiellement publié l’interface R pour igraph en 2006. Depuis son adaptation à R, igraph a régulièrement été mis à jour pour fournir de nouvelles fonctionnalités et améliorations de performances.\nDans le langage de programmation R, l’interface igraph est écrite en R, mais elle utilise des liens (bindings) vers les fonctions C fournies par le package igraph. Les liens permettent à l’utilisateur d’appeler des fonctions C depuis R, ce qui permet de bénéficier de la rapidité et de l’efficacité de l’implémentation en C d’igraph.\nigraph permet l’analyse des réseaux unimodaux orientés, non orientés et/ou valués. Il permet la transformation de réseaux bimodaux ou multiplexes mais ne propose pas ou peu de méthodes pour les analyser. Composée de 801 fonctions, cette librairie offre une grande variété de mesures de réseau, telles que la centralité, la proximité, l’intermédiarité des sommets et des liens, la modularité, la densité, la distance, etc.\nLe nombre très élevé de fonctions ne doit pas impressionner : il existe souvent plusieurs fonctions permettant de réaliser la même opération. Ceci alourdit la documentation mais assure une bonne rétro-compatibilité des scripts qui utilisent igraph. Un script écrit il y a 5 ou 10 ans fonctionne encore aujourd’hui, ce qui est rare dans R.\nigraph est également très flexible et peut être utilisé avec d’autres packages R, tels que ggplot2, shiny ou encore dplyr (tidyverse).",
    "crumbs": [
      "Le package `igraph`"
    ]
  },
  {
    "objectID": "index.html#installation",
    "href": "index.html#installation",
    "title": "Analyse de réseau avec igraph",
    "section": "Installation",
    "text": "Installation\n\ninstall.packages(\"igraph\")",
    "crumbs": [
      "Le package `igraph`"
    ]
  },
  {
    "objectID": "index.html#documentation",
    "href": "index.html#documentation",
    "title": "Analyse de réseau avec igraph",
    "section": "Documentation",
    "text": "Documentation\nPour accéder à la documentation interne, utilisez les fonctions suivantes :\n\n# Chargement de la librairie\nlibrary(igraph)\n\n# Ouverture de l'onglet d'aide\n?igraph\n\n# Métadonnées & liste des fonctions\nlibrary(help=\"igraph\")\n\nVous pouvez également consulter la documentation officielle du package en ligne :\n\nSite du package igraph (R)\n\nR igraph manual pages",
    "crumbs": [
      "Le package `igraph`"
    ]
  },
  {
    "objectID": "index.html#citation",
    "href": "index.html#citation",
    "title": "Analyse de réseau avec igraph",
    "section": "Citation",
    "text": "Citation\nSource: inst/CITATION\nCsardi G, Nepusz T (2006). “The igraph software package for complex network research.” InterJournal, Complex Systems, 1695. https://igraph.org.\n\n@Article{,\n  title = {The igraph software package for complex network research},\n  author = {Gabor Csardi and Tamas Nepusz},\n  journal = {InterJournal},\n  volume = {Complex Systems},\n  pages = {1695},\n  year = {2006},\n  url = {https://igraph.org},\n}",
    "crumbs": [
      "Le package `igraph`"
    ]
  },
  {
    "objectID": "igraph.html",
    "href": "igraph.html",
    "title": "1  L’objet igraph",
    "section": "",
    "text": "1.1 Le jeu de données karate\nLes données utilisées sont fournies par le package igraphdata. Il s’agit du jeu de données karate qui contient le réseau social entre les membres d’un club de karaté universitaire dirigé par le président John A. et l’instructeur de karaté M. Hi (pseudonymes).\nCes données ont été collectées par l’anthropologue américain Wayne Zachary, d’où le nom de Zachary karate club souvent utilisé pour nommer ce jeu de données. Il a observé les relations entre praticiens d’un club de karaté pendant plus de deux ans dans huit contextes sociaux différents. Les matrices de relations ont ensuite été agrégées, ce qui donne un réseau non orienté et valué ; l’intensité des liens correspond au nombre de contextes différents dans lesquels deux praticiens sont en relation. Ce jeu est souvent utilisé pour tester des méthodes de détection de communautés pour une raison simple : lors de son observation, une scission s’est produite et un club dissident a été créé, drainant une partie des élèves.\n# Chargement de la librairie igraphdata\nlibrary(igraphdata)\n\n# Chargement du jeu de données exemple\ndata(karate)\n\n# Description du jeu de données\n?karate",
    "crumbs": [
      "<span class='chapter-number'>1</span>  <span class='chapter-title'>L'objet `igraph`</span>"
    ]
  },
  {
    "objectID": "igraph.html#le-jeu-de-données-karate",
    "href": "igraph.html#le-jeu-de-données-karate",
    "title": "1  L’objet igraph",
    "section": "",
    "text": "1.1.1 Propriétés des arêtes (edges)\n\n\n\n\n\n\n\n\n1.1.2 Propriétés des sommets (vertices)",
    "crumbs": [
      "<span class='chapter-number'>1</span>  <span class='chapter-title'>L'objet `igraph`</span>"
    ]
  },
  {
    "objectID": "igraph.html#construction-dun-graphe",
    "href": "igraph.html#construction-dun-graphe",
    "title": "1  L’objet igraph",
    "section": "1.2 Construction d’un graphe",
    "text": "1.2 Construction d’un graphe\nIl est possible de construire un objet igraph à partir de différents types de données :\n\nune liste de liens (arêtes) : graph_from_edgelist() ;\nune matrice d’adjacence (arêtes) : graph_from_adjacency_matrix();\nun ou deux tableaux (arêtes, arêtes et sommets) : graph_from_data_frame().\n\n\n\n\n\n\n\nLe package igraph permet également d’importer (et d’exporter) des graphes de différents formats : Pajek, GraphViz, LEDA, GML, GraphML, DIMACS, LGL…\n\n\n\nConstruire un graphe à partir d’un data.frame de liens (arêtes) et d’un data.frame contenant les sommets.\n\n# Création de l'objet `igraph`\nkarate &lt;- graph_from_data_frame(d = tableau_aretes,\n                                vertices = tableau_sommets, \n                                directed = FALSE)\n\nAjouter des attributs à l’ensemble du graphe.\n\n# Un nom\ngraph_attr(karate, \"name\") &lt;- \"Zachary's karate club network\"\n\n# Des auteurs\ngraph_attr(karate, \"Author\") &lt;- \"Wayne W. Zachary\"\n\n# Une citation\ngraph_attr(karate, \"Citation\") &lt;- \"Wayne W. Zachary. An Information Flow Model for Conflict and Fission in Small Groups. Journal of Anthropological Research Vol. 33, No. 4 452-473\"",
    "crumbs": [
      "<span class='chapter-number'>1</span>  <span class='chapter-title'>L'objet `igraph`</span>"
    ]
  },
  {
    "objectID": "igraph.html#interrogation-dun-graphe",
    "href": "igraph.html#interrogation-dun-graphe",
    "title": "1  L’objet igraph",
    "section": "1.3 Interrogation d’un graphe",
    "text": "1.3 Interrogation d’un graphe\n\nclass(karate)\n\n[1] \"igraph\"\n\nsummary(karate)\n\nIGRAPH 20bd41a UNW- 34 78 -- Zachary's karate club network\n+ attr: name (g/c), Author (g/c), Citation (g/c), name (v/c), label\n| (v/c), Faction (v/n), color (v/n), weight (e/n)\n\n\nDescription de l’objet igraph en trois ou quatre lettres :\nD ou U : graphe orienté, Directed ou Undirected\nN : Named graph, les sommets possèdent un attribut name\nW : pondéré, les liens possèdent un attribut weight.\nLorsqu’un B est présent, cela signale un graphe considéré comme bimodal (bipartite): les sommets possèdent un attribut type (booléen) qui différencie les deux ensembles de sommets.\nLes chiffres qui suivent (34 et 78) indiquent le nombre de sommets (ordre) et le nombre d’arêtes (taille).\nChaque attribut est également listé. La première lettre indique à quel élément se rattache l’attribut et la seconde indique le type de variable. Exemple :\n(g/c) = Graph/Character\n(v/c) = Vertex / Character\n(e/n) = Edge / Numeric\nLa fonction str() permet d’avoir une vision plus détaillée du graphe.\n\nstr(karate)\n\nClass 'igraph'  hidden list of 10\n $ : num 34\n $ : logi FALSE\n $ : num [1:78] 1 2 3 4 5 6 7 8 10 11 ...\n $ : num [1:78] 0 0 0 0 0 0 0 0 0 0 ...\n $ : NULL\n $ : NULL\n $ : NULL\n $ : NULL\n $ :List of 4\n  ..$ : num [1:3] 1 0 1\n  ..$ :List of 3\n  .. ..$ name    : chr \"Zachary's karate club network\"\n  .. ..$ Author  : chr \"Wayne W. Zachary\"\n  .. ..$ Citation: chr \"Wayne W. Zachary. An Information Flow Model for Conflict and Fission in Small Groups. Journal of Anthropologica\"| __truncated__\n  ..$ :List of 4\n  .. ..$ name   : chr [1:34] \"Mr Hi\" \"Actor 2\" \"Actor 3\" \"Actor 4\" ...\n  .. ..$ label  : chr [1:34] \"H\" \"2\" \"3\" \"4\" ...\n  .. ..$ Faction: num [1:34] 1 1 1 1 1 1 1 1 2 2 ...\n  .. ..$ color  : num [1:34] 1 1 1 1 1 1 1 1 2 2 ...\n  ..$ :List of 1\n  .. ..$ weight: num [1:78] 4 5 3 3 3 3 2 2 2 3 ...\n $ :&lt;environment: 0x589a2d6c70f8&gt; \n\n\nLes fonctions V() et E() permettent de lister les sommets et les arêtes du graphe.\n\n# Vertices - Sommets\nV(karate)\n\n+ 34/34 vertices, named, from 20bd41a:\n [1] Mr Hi    Actor 2  Actor 3  Actor 4  Actor 5  Actor 6  Actor 7  Actor 8 \n [9] Actor 9  Actor 10 Actor 11 Actor 12 Actor 13 Actor 14 Actor 15 Actor 16\n[17] Actor 17 Actor 18 Actor 19 Actor 20 Actor 21 Actor 22 Actor 23 Actor 24\n[25] Actor 25 Actor 26 Actor 27 Actor 28 Actor 29 Actor 30 Actor 31 Actor 32\n[33] Actor 33 John A  \n\n# Edge - Arêtes\nE(karate)\n\n+ 78/78 edges from 20bd41a (vertex names):\n [1] Mr Hi  --Actor 2  Mr Hi  --Actor 3  Mr Hi  --Actor 4  Mr Hi  --Actor 5 \n [5] Mr Hi  --Actor 6  Mr Hi  --Actor 7  Mr Hi  --Actor 8  Mr Hi  --Actor 9 \n [9] Mr Hi  --Actor 11 Mr Hi  --Actor 12 Mr Hi  --Actor 13 Mr Hi  --Actor 14\n[13] Mr Hi  --Actor 18 Mr Hi  --Actor 20 Mr Hi  --Actor 22 Mr Hi  --Actor 32\n[17] Actor 2--Actor 3  Actor 2--Actor 4  Actor 2--Actor 8  Actor 2--Actor 14\n[21] Actor 2--Actor 18 Actor 2--Actor 20 Actor 2--Actor 22 Actor 2--Actor 31\n[25] Actor 3--Actor 4  Actor 3--Actor 8  Actor 3--Actor 9  Actor 3--Actor 10\n[29] Actor 3--Actor 14 Actor 3--Actor 28 Actor 3--Actor 29 Actor 3--Actor 33\n[33] Actor 4--Actor 8  Actor 4--Actor 13 Actor 4--Actor 14 Actor 5--Actor 7 \n[37] Actor 5--Actor 11 Actor 6--Actor 7  Actor 6--Actor 11 Actor 6--Actor 17\n+ ... omitted several edges\n\n\nComme avec un data.frame, on utilise un $ pour sélectionner un attribut.\n\n# Valeurs de l'attribut \"Faction\" des sommets\nV(karate)$Faction\n\n [1] 1 1 1 1 1 1 1 1 2 2 1 1 1 1 2 2 1 1 2 1 2 1 2 2 2 2 2 2 2 2 2 2 2 2\n\n# Valeurs de l'attribut \"weight\" des arêtes\nE(karate)$weight\n\n [1] 4 5 3 3 3 3 2 2 2 3 1 3 2 2 2 2 6 3 4 5 1 2 2 2 3 4 5 1 3 2 2 2 3 3 3 2 3 5\n[39] 3 3 3 3 3 4 2 3 3 2 3 4 1 2 1 3 1 2 3 5 4 3 5 4 2 3 2 7 4 2 4 2 2 4 2 3 3 4\n[77] 4 5\n\n\nLister l’ensemble des attributs des sommets et des arêtes.\n\n# Attributs des sommets\nvertex_attr(karate)\n\n$name\n [1] \"Mr Hi\"    \"Actor 2\"  \"Actor 3\"  \"Actor 4\"  \"Actor 5\"  \"Actor 6\" \n [7] \"Actor 7\"  \"Actor 8\"  \"Actor 9\"  \"Actor 10\" \"Actor 11\" \"Actor 12\"\n[13] \"Actor 13\" \"Actor 14\" \"Actor 15\" \"Actor 16\" \"Actor 17\" \"Actor 18\"\n[19] \"Actor 19\" \"Actor 20\" \"Actor 21\" \"Actor 22\" \"Actor 23\" \"Actor 24\"\n[25] \"Actor 25\" \"Actor 26\" \"Actor 27\" \"Actor 28\" \"Actor 29\" \"Actor 30\"\n[31] \"Actor 31\" \"Actor 32\" \"Actor 33\" \"John A\"  \n\n$label\n [1] \"H\"  \"2\"  \"3\"  \"4\"  \"5\"  \"6\"  \"7\"  \"8\"  \"9\"  \"10\" \"11\" \"12\" \"13\" \"14\" \"15\"\n[16] \"16\" \"17\" \"18\" \"19\" \"20\" \"21\" \"22\" \"23\" \"24\" \"25\" \"26\" \"27\" \"28\" \"29\" \"30\"\n[31] \"31\" \"32\" \"33\" \"A\" \n\n$Faction\n [1] 1 1 1 1 1 1 1 1 2 2 1 1 1 1 2 2 1 1 2 1 2 1 2 2 2 2 2 2 2 2 2 2 2 2\n\n$color\n [1] 1 1 1 1 1 1 1 1 2 2 1 1 1 1 2 2 1 1 2 1 2 1 2 2 2 2 2 2 2 2 2 2 2 2\n\n# Attributs des arêtes\nedge_attr(karate)\n\n$weight\n [1] 4 5 3 3 3 3 2 2 2 3 1 3 2 2 2 2 6 3 4 5 1 2 2 2 3 4 5 1 3 2 2 2 3 3 3 2 3 5\n[39] 3 3 3 3 3 4 2 3 3 2 3 4 1 2 1 3 1 2 3 5 4 3 5 4 2 3 2 7 4 2 4 2 2 4 2 3 3 4\n[77] 4 5",
    "crumbs": [
      "<span class='chapter-number'>1</span>  <span class='chapter-title'>L'objet `igraph`</span>"
    ]
  },
  {
    "objectID": "igraph.html#réseau-valué",
    "href": "igraph.html#réseau-valué",
    "title": "1  L’objet igraph",
    "section": "1.4 Réseau valué",
    "text": "1.4 Réseau valué\nPour que le graphe soit considéré comme valué, la table de liens doit contenir un attribut (numeric) nommé weight. C’est le cas dans le jeu de données karate.\n\nE(karate)$weight\n\n [1] 4 5 3 3 3 3 2 2 2 3 1 3 2 2 2 2 6 3 4 5 1 2 2 2 3 4 5 1 3 2 2 2 3 3 3 2 3 5\n[39] 3 3 3 3 3 4 2 3 3 2 3 4 1 2 1 3 1 2 3 5 4 3 5 4 2 3 2 7 4 2 4 2 2 4 2 3 3 4\n[77] 4 5\n\n# Fonction pour savoir si le graphe est valué\nis_weighted(karate)\n\n[1] TRUE",
    "crumbs": [
      "<span class='chapter-number'>1</span>  <span class='chapter-title'>L'objet `igraph`</span>"
    ]
  },
  {
    "objectID": "igraph.html#modification-dun-graphe",
    "href": "igraph.html#modification-dun-graphe",
    "title": "1  L’objet igraph",
    "section": "1.5 Modification d’un graphe",
    "text": "1.5 Modification d’un graphe\nAjouter des sommets.\n\nkarate &lt;- add_vertices(graph = karate, \n                       nv = 1, \n                       name = \"Toto\",\n                       label = \"35\",\n                       Faction = 1,\n                       color = 1)\n\nAjouter des arêtes.\n\nkarate &lt;- add_edges(graph = karate, \n                    edges = c(\"Mr Hi\", \"Toto\", \"Toto\", \"Actor 2\"),\n                    attr = list(weight = 5))\n\nsummary(karate)\n\nIGRAPH 7d3b4ac UNW- 35 80 -- Zachary's karate club network\n+ attr: name (g/c), Author (g/c), Citation (g/c), name (v/c), label\n| (v/c), Faction (v/n), color (v/n), weight (e/n)\n\n\nModifier ou supprimer les attributs des sommets ou des arêtes.\nLes arguments à renseigner pour les modifications sont graph (nom du graphe), name (nom de l’attribut à modifier), index (sous-ensemble d’arêtes que l’on veut modifier, optionnel), value (nouvelle valeur de l’attribut pour toutes les arêtes ou pour les arêtes du sous-ensemble défini dans index).\n\n# Suppression\ndelete_edge_attr() \ndelete_vertex_attr() \n\n# Modification\nset_edge_attr() \nset_vertex_attr()\n\nCréer un attribut.\nLes valeurs doivent respecter l’ordre des sommets de l’objet igraph.\n\nV(karate)$position &lt;-  c(\"Maître\", \"Elève\", \"Elève\", \"Elève\", \"Elève\", \"Elève\", \"Elève\", \"Elève\", \"Elève\", \n                         \"Elève\", \"Elève\", \"Elève\",  \"Elève\", \"Elève\", \"Elève\", \"Elève\", \"Elève\", \"Elève\", \n                         \"Elève\", \"Elève\", \"Elève\", \"Elève\", \"Elève\", \"Elève\", \"Elève\", \"Elève\", \"Elève\", \n                         \"Elève\", \"Elève\", \"Elève\", \"Elève\", \"Elève\", \"Elève\", \"Maître\", \"Elève\")",
    "crumbs": [
      "<span class='chapter-number'>1</span>  <span class='chapter-title'>L'objet `igraph`</span>"
    ]
  },
  {
    "objectID": "igraph.html#extraction-dun-sous-graphe",
    "href": "igraph.html#extraction-dun-sous-graphe",
    "title": "1  L’objet igraph",
    "section": "1.6 Extraction d’un sous-graphe",
    "text": "1.6 Extraction d’un sous-graphe\nExtraire des sous-graphes à partir d’un attribut des sommets.\n\n# Sélection des membres de la faction 1\nkarate_faction_1 &lt;- induced_subgraph(karate, v = which(V(karate)$Faction == 1))\n\n# Sélection des membres de la faction 2\nkarate_faction_2 &lt;- induced_subgraph(karate, v = which(V(karate)$Faction == 2))\n\n\n\n\n\n\n\n\n\n\nExtraire un sous-graphe en fonction d’un attribut des liens.\n\n# Sélection des liens d'intensité supérieure ou égale à 4\nlien_intens_sup_4 &lt;- subgraph.edges(karate, eids = which(E(karate)$weight &gt; 4))",
    "crumbs": [
      "<span class='chapter-number'>1</span>  <span class='chapter-title'>L'objet `igraph`</span>"
    ]
  },
  {
    "objectID": "igraph.html#extraction-des-ego-networks",
    "href": "igraph.html#extraction-des-ego-networks",
    "title": "1  L’objet igraph",
    "section": "1.7 Extraction des ego-networks",
    "text": "1.7 Extraction des ego-networks\nLa fonction make_ego_graph permet d’extraire les ego-networks d’un graphe. L’argument order permet de choisir le niveau de voisinage à prendre en compte (1 par défaut). L’argument mode permet de prendre en compte tous les liens (“all”), uniquement les liens entrants (“in”) ou uniquement les liens sortants (“out”) dans le cas d’un réseau orienté.\n\n# Création d'une liste d'objets igraph (tous les ego-networks) \nEgoNet_karate &lt;- make_ego_graph(karate)\n\n# Paramétrage de l'ego network\nEgoNet_karate &lt;- make_ego_graph(karate,\n                                nodes = V(karate),\n                                order = 1,\n                                mode = c(\"all\"))\n\n# Sélectionner un ego-network dans la liste - V(karate)$name[1]\nEgoNet_karate[[1]] # ici le premier \n\nIGRAPH d54363b UNW- 18 36 -- Zachary's karate club network\n+ attr: name (g/c), Author (g/c), Citation (g/c), name (v/c), label\n| (v/c), Faction (v/n), color (v/n), position (v/c), weight (e/n)\n+ edges from d54363b (vertex names):\n [1] Mr Hi  --Actor 2  Mr Hi  --Actor 3  Mr Hi  --Actor 4  Mr Hi  --Actor 5 \n [5] Mr Hi  --Actor 6  Mr Hi  --Actor 7  Mr Hi  --Actor 8  Mr Hi  --Actor 9 \n [9] Mr Hi  --Actor 11 Mr Hi  --Actor 12 Mr Hi  --Actor 13 Mr Hi  --Actor 14\n[13] Mr Hi  --Actor 18 Mr Hi  --Actor 20 Mr Hi  --Actor 22 Mr Hi  --Actor 32\n[17] Actor 2--Actor 3  Actor 2--Actor 4  Actor 2--Actor 8  Actor 2--Actor 14\n[21] Actor 2--Actor 18 Actor 2--Actor 20 Actor 2--Actor 22 Actor 3--Actor 4 \n[25] Actor 3--Actor 8  Actor 3--Actor 9  Actor 3--Actor 14 Actor 4--Actor 8 \n+ ... omitted several edges\n\n# Création d'un ego-network à partir d'un nom (crée une liste avec un ego-network)\nEgoNet_JohnA &lt;- make_ego_graph(karate,\n                               nodes = V(karate)[name=='John A'], # on peut aussi faire label==\"A\"\n                               order = 1,\n                               mode = c(\"all\"))\nEgoNet_JohnA[[1]]\n\nIGRAPH 030da36 UNW- 18 32 -- Zachary's karate club network\n+ attr: name (g/c), Author (g/c), Citation (g/c), name (v/c), label\n| (v/c), Faction (v/n), color (v/n), position (v/c), weight (e/n)\n+ edges from 030da36 (vertex names):\n [1] Actor 9 --Actor 31 Actor 9 --Actor 33 Actor 9 --John A   Actor 10--John A  \n [5] Actor 14--John A   Actor 15--Actor 33 Actor 15--John A   Actor 16--Actor 33\n [9] Actor 16--John A   Actor 19--Actor 33 Actor 19--John A   Actor 20--John A  \n[13] Actor 21--Actor 33 Actor 21--John A   Actor 23--Actor 33 Actor 23--John A  \n[17] Actor 24--Actor 28 Actor 24--Actor 30 Actor 24--Actor 33 Actor 24--John A  \n[21] Actor 27--Actor 30 Actor 27--John A   Actor 28--John A   Actor 29--Actor 32\n[25] Actor 29--John A   Actor 30--Actor 33 Actor 30--John A   Actor 31--Actor 33\n+ ... omitted several edges\n\n\n\n\n\n\n\n\n\n\n\nSupprimer ego de son réseau personnel.\n\nKarate_sans_Hi &lt;- induced_subgraph(EgoNet_karate[[1]], \n                                   v = which(V(EgoNet_karate[[1]])$name != c(\"Mr Hi\")))\n\n\n\n\n\n\n\n\n\n\n\n\nS’il est facile de créer les réseaux personnels à partir d’un réseau complet, igraph ne propose pas les mesures spécifiques développées pour l’analyse des réseaux personnels.",
    "crumbs": [
      "<span class='chapter-number'>1</span>  <span class='chapter-title'>L'objet `igraph`</span>"
    ]
  },
  {
    "objectID": "igraph.html#boucles-et-liens-multiples",
    "href": "igraph.html#boucles-et-liens-multiples",
    "title": "1  L’objet igraph",
    "section": "1.8 Boucles et liens multiples",
    "text": "1.8 Boucles et liens multiples\nigraph peut prendre en charge des réseaux avec boucles (liens d’un sommet vers lui-même) et liens multiples ; certaines mesures fonctionnent sans problème avec ce type de réseau. La fonction simplify() permet de transformer ces réseaux en réseaux simples. La fonction simplify_and_colorize() permet de garder en mémoire l’existence de ces boucles et liens multiples.\n\n# Manipulation d'un réseau avec boucle et liens multiples\ngbm &lt;- d1 &lt;- rbind(c(\"A\",\"A\"),\n                   c(\"A\",\"B\"),\n                   c(\"B\",\"C\"), \n                   c(\"B\",\"C\"), \n                   c(\"B\",\"C\"), \n                   c(\"C\",\"D\"), \n                   c(\"C\",\"D\"))\n\n\ng1 &lt;- graph.data.frame(d1, directed = FALSE)\n\nWarning: `graph.data.frame()` was deprecated in igraph 2.0.0.\nℹ Please use `graph_from_data_frame()` instead.\n\ng1\n\nIGRAPH 1d083fd UN-- 4 7 -- \n+ attr: name (v/c)\n+ edges from 1d083fd (vertex names):\n[1] A--A A--B B--C B--C B--C C--D C--D\n\nis.loop(g1)\n\nWarning: `is.loop()` was deprecated in igraph 2.0.0.\nℹ Please use `which_loop()` instead.\n\n\n[1]  TRUE FALSE FALSE FALSE FALSE FALSE FALSE\n\nis.multiple(g1)\n\nWarning: `is.multiple()` was deprecated in igraph 2.0.0.\nℹ Please use `which_multiple()` instead.\n\n\n[1] FALSE FALSE FALSE  TRUE  TRUE FALSE  TRUE\n\nplot(g1)\n\n\n\n\n\n\n\ndegree(g1)\n\nA B C D \n3 4 5 2 \n\n\nLa fonction degree() donne un résultat satisfaisant. Le sommet A a un degré de 3 : un lien avec B et une boucle. Par convention, une boucle est considérée comme un lien entrant plus un lien sortant et le degré d’un sommet avec boucle est donc toujours supérieur ou égal à 2.\n\ngraph.density(g1)\n\nWarning: `graph.density()` was deprecated in igraph 2.0.0.\nℹ Please use `edge_density()` instead.\n\n\n[1] 1.166667\n\n\nPar contre, la densité donne un résultat logique mais peu satisfaisant. Il considère qu’il y a 7 liens présents et 6 liens possibles (4*3/2) d’où une densité supérieure à 1. Or, le nombre de liens possibles est de 10 (si on considère que des boucles peuvent être partout présentes) voire de 22 (3 liens possibles entre chaque paire de sommets donc 3 fois 6, plus 4 boucles).\nL’approche standard en analyse de réseau avec ce type d’objet est de commencer par supprimer boucles et liens multiples.\n\n# Par défaut, simplify supprimer boucles et liens multiples\ng1_2 &lt;- simplify(g1)\nplot(g1_2)\n\n\n\n\n\n\n\n# Si je veux garder les liens multiples\ng1_3 &lt;- simplify(g1, remove.multiple = FALSE)\nplot(g1_3)\n\n\n\n\n\n\n\n# Si je veux garder une trace des boucles et des liens multiples\ng1_4 &lt;- simplify_and_colorize(g1)\ng1_4\n\nIGRAPH e10d411 U--- 4 3 -- \n+ attr: color (v/n), color (e/n)\n+ edges from e10d411:\n[1] 1--2 2--3 3--4\n\nV(g1_4)$color # il y avait une boucle au premier sommet\n\n[1] 1 0 0 0\n\nE(g1_4)$color # il y avait 1 lien, 3 liens, 2 liens\n\n[1] 1 3 2",
    "crumbs": [
      "<span class='chapter-number'>1</span>  <span class='chapter-title'>L'objet `igraph`</span>"
    ]
  },
  {
    "objectID": "igraph.html#réseau-bimodal-ou-biparti",
    "href": "igraph.html#réseau-bimodal-ou-biparti",
    "title": "1  L’objet igraph",
    "section": "1.9 Réseau bimodal (ou biparti)",
    "text": "1.9 Réseau bimodal (ou biparti)\nPour qu’un réseau soit considéré comme biparti, il faut que la table des sommets contienne un attribut booléen nommé type pour différencier les deux catégories de sommets. Cette condition est nécessaire et suffisante.\n\n# Fonction pour savoir si le graphe est biparti\nis.bipartite(karate)\n\n[1] FALSE\n\n# Création de l'attribut \"type\" \n# Valeur booléenne pour dissocier les deux groupes\nV(karate)$type &lt;- ifelse(V(karate)$color == 1, TRUE, FALSE)\n\n# La présence de l'attribut \"type\" rend l'objet igraph biparti\nis.bipartite(karate)\n\n[1] TRUE\n\n\nComme il y a un attribut type booléen sur les sommets, igraph considère que le réseau est bimodal alors que la liste des liens montre qu’il ne l’est pas. Il ne sera pas possible, et c’est normal, de transformer ce faux réseau bimodal.\nLe script ci-dessous crée un mini réseau bimodal. igraph permet peu d’analyse. Si le degré donne un résultat correct, le degré normalisé est faux, tout comme la densité.\n\n# Création d'un réseau minimal\nsom &lt;- c(\"a1\",\"a2\",\"a3\",\"a4\",\"A1\",\"A2\",\"A3\")\nsomtype &lt;- c(0,1,0,1,1,0,0)\ngb &lt;- make_graph(c(\"a1\",\"A1\",\"a2\",\"A1\",\n                     \"a2\",\"A2\",\"a2\",\"A3\",\n                     \"a3\",\"A2\",\"a4\",\"A3\",\n                     \"a4\", \"A2\"), directed = FALSE)\n\ngb\n\nIGRAPH 749f45a UN-- 7 7 -- \n+ attr: name (v/c)\n+ edges from 749f45a (vertex names):\n[1] a1--A1 A1--a2 a2--A2 a2--A3 A2--a3 A3--a4 A2--a4\n\n\nIl n’y a pas de variable attribut booléen ‘type’, le réseau est donc considéré comme un réseau unimodal.\n\nV(gb)$type &lt;- somtype\n\ngb\n\nIGRAPH 749f45a UN-B 7 7 -- \n+ attr: name (v/c), type (v/n)\n+ edges from 749f45a (vertex names):\n[1] a1--A1 A1--a2 a2--A2 a2--A3 A2--a3 A3--a4 A2--a4\n\n\nUN-B signale que le réseau est dorénavant considéré comme biparti.\n\nplot(gb, layout = layout_as_bipartite(gb))\n\n\n\n\n\n\n\n# Degré : résultat correct\ndegree(gb)\n\na1 A1 a2 A2 A3 a3 a4 \n 1  2  3  3  2  1  2 \n\n# Degré nortmalisé : résultat faux\ndegree(gb, normalized = TRUE)\n\n       a1        A1        a2        A2        A3        a3        a4 \n0.1666667 0.3333333 0.5000000 0.5000000 0.3333333 0.1666667 0.3333333 \n\n# Densité : résultat faux\ngraph.density(gb)\n\n[1] 0.3333333\n\n\nDans un réseau bimodal \\(G = \\{V_1, V_2, E\\}\\), le degré maximum d’un sommet de l’ensemble \\(V_1\\) est égal au nombre de sommets de l’ensemble \\(V_2\\). Pour normaliser, on divise par le nombre du sommets de l’autre ensemble. Ici par exemple, a1 a un degré de 1, le maximum est 3, son degré normalisé est donc de 1/3.\nEn ce qui concerne la densité, le nombre maximum de liens possibles est égal à \\(V_1 \\times V_2\\) soit 12 dans cet exemple. Il y a 7 liens, la densité est donc de 0.58.\nL’une des seules options disponibles est la possibilité de le projeter pour créer deux réseaux unimodaux valués.\nSi je considère que les lettres majuscules sont des autrices publiant dans des revues (lettres minuscules), un lien entre deux revues (réseau du milieu) indique combien ces revues partagent d’autrices en commun. Un lien entre deux autrices dans le réseau valué de droite indiquent dans combien de revues communes elles ont publié.\n\n# Projections du réseau bimodal\npro &lt;- bipartite.projection(gb)\n\n# Intensité des liens dans la première projection\nE(pro[[1]])$weight\n\n[1] 1 1 2 1\n\n# Intensité des liens dans la deuxième projection\nE(pro[[2]])$weight\n\n[1] 1 1 2\n\n\nVisualisation du réseau biparti et des deux projections qui en découlent :",
    "crumbs": [
      "<span class='chapter-number'>1</span>  <span class='chapter-title'>L'objet `igraph`</span>"
    ]
  },
  {
    "objectID": "igraph.html#exporter-un-objet-igraph",
    "href": "igraph.html#exporter-un-objet-igraph",
    "title": "1  L’objet igraph",
    "section": "1.10 Exporter un objet igraph",
    "text": "1.10 Exporter un objet igraph\nExtraire les tableaux des sommets et des arêtes avec leur attributs.\n\n# Extraction des liens et de leurs attributs\ntableau_aretes &lt;- as_data_frame(karate, what=\"edges\")\n\n# Extraction des sommets et de leurs attributs\ntableau_sommets &lt;- as_data_frame(karate, what=\"vertices\")",
    "crumbs": [
      "<span class='chapter-number'>1</span>  <span class='chapter-title'>L'objet `igraph`</span>"
    ]
  },
  {
    "objectID": "indicateurs.html",
    "href": "indicateurs.html",
    "title": "2  Indicateurs globaux",
    "section": "",
    "text": "2.1 Nombre de sommets et d’arêtes\nCalculer le nombre de sommets (ordre) et d’arêtes (taille) du graphe.\n# Nombre de sommets\nvcount(karate)\n\n[1] 34\n\n# Nombre d'arêtes\necount(karate)\n\n[1] 78",
    "crumbs": [
      "<span class='chapter-number'>2</span>  <span class='chapter-title'>Indicateurs globaux</span>"
    ]
  },
  {
    "objectID": "indicateurs.html#densité",
    "href": "indicateurs.html#densité",
    "title": "2  Indicateurs globaux",
    "section": "2.2 Densité",
    "text": "2.2 Densité\nLa densité d’un graphe désigne le rapport entre le nombre de liens présents et le nombre de liens possibles. Elle varie entre 0 (graphe vide, aucun lien) et 1 (graphe complet, tous les sommets sont directement reliés entre eux).\n\n# Densité d'un graphe\ngraph.density(karate)\n\n[1] 0.1390374",
    "crumbs": [
      "<span class='chapter-number'>2</span>  <span class='chapter-title'>Indicateurs globaux</span>"
    ]
  },
  {
    "objectID": "indicateurs.html#composantes-connexes",
    "href": "indicateurs.html#composantes-connexes",
    "title": "2  Indicateurs globaux",
    "section": "2.3 Composantes connexes",
    "text": "2.3 Composantes connexes\nUn graphe est dit connexe s’il existe au moins un chemin entre toutes les paires de sommets. Dans le cas contraire, le graphe est constitué de différentes composantes connexes.\n\n# Composantes connexes d'un graphe\ncomponents(karate)\n\n$membership\n   Mr Hi  Actor 2  Actor 3  Actor 4  Actor 5  Actor 6  Actor 7  Actor 8 \n       1        1        1        1        1        1        1        1 \n Actor 9 Actor 10 Actor 11 Actor 12 Actor 13 Actor 14 Actor 15 Actor 16 \n       1        1        1        1        1        1        1        1 \nActor 17 Actor 18 Actor 19 Actor 20 Actor 21 Actor 22 Actor 23 Actor 24 \n       1        1        1        1        1        1        1        1 \nActor 25 Actor 26 Actor 27 Actor 28 Actor 29 Actor 30 Actor 31 Actor 32 \n       1        1        1        1        1        1        1        1 \nActor 33   John A \n       1        1 \n\n$csize\n[1] 34\n\n$no\n[1] 1\n\n\nLa fonction crée une liste composée de trois éléments :\n\nmembership : identifiant de la composante connexe d’appartenance\n\ncsize : nombre de sommets des composantes connexes\n\nno : nombre de composantes connexes\n\nExtraire toute les composantes connexes.\n\nMes_composantes &lt;- decompose(karate)\n\n# Cela construit un objet List d'objets igraph\nMes_composantes\n\n[[1]]\nIGRAPH 7342568 UNW- 34 78 -- Zachary's karate club network\n+ attr: name (g/c), Citation (g/c), Author (g/c), Faction (v/n), name\n| (v/c), label (v/c), color (v/n), weight (e/n)\n+ edges from 7342568 (vertex names):\n [1] Mr Hi  --Actor 2  Mr Hi  --Actor 3  Mr Hi  --Actor 4  Mr Hi  --Actor 5 \n [5] Mr Hi  --Actor 6  Mr Hi  --Actor 7  Mr Hi  --Actor 8  Mr Hi  --Actor 9 \n [9] Mr Hi  --Actor 11 Mr Hi  --Actor 12 Mr Hi  --Actor 13 Mr Hi  --Actor 14\n[13] Mr Hi  --Actor 18 Mr Hi  --Actor 20 Mr Hi  --Actor 22 Mr Hi  --Actor 32\n[17] Actor 2--Actor 3  Actor 2--Actor 4  Actor 2--Actor 8  Actor 2--Actor 14\n[21] Actor 2--Actor 18 Actor 2--Actor 20 Actor 2--Actor 22 Actor 2--Actor 31\n[25] Actor 3--Actor 4  Actor 3--Actor 8  Actor 3--Actor 9  Actor 3--Actor 10\n+ ... omitted several edges\n\n# Accéder à chaque objet igraph créé\ncomposante_1 &lt;- Mes_composantes[[1]]",
    "crumbs": [
      "<span class='chapter-number'>2</span>  <span class='chapter-title'>Indicateurs globaux</span>"
    ]
  },
  {
    "objectID": "indicateurs.html#diamètre",
    "href": "indicateurs.html#diamètre",
    "title": "2  Indicateurs globaux",
    "section": "2.4 Diamètre",
    "text": "2.4 Diamètre\nLe diamètre d’un graphe est le plus long des plus courts chemins du graphe.\n\n# Diamètre d'un graphe (valué)\ndiameter(karate)\n\n[1] 13\n\n\nPar défaut, la fonction diameter() prend en compte le poids (weight) des liens.\n\n# Diamètre d'un graphe (topologique)\ndiameter(karate, directed = FALSE, weights = NA)\n\n[1] 5\n\n\n\n\n\n\n\n\nSi le graphe possède plusieurs composantes connexes, la fonction renvoie le plus grand diamètre.\n\n\n\nPour connaître les sommets du diamètre.\n\nget_diameter(karate, weights = NA)\n\n+ 6/34 vertices, named, from 4b458a1:\n[1] Actor 15 Actor 33 Actor 3  Mr Hi    Actor 6  Actor 17",
    "crumbs": [
      "<span class='chapter-number'>2</span>  <span class='chapter-title'>Indicateurs globaux</span>"
    ]
  },
  {
    "objectID": "indicateurs.html#transitivité-globale",
    "href": "indicateurs.html#transitivité-globale",
    "title": "2  Indicateurs globaux",
    "section": "2.5 Transitivité globale",
    "text": "2.5 Transitivité globale\nLa transitivité d’un graphe mesure la proportion de triades fermées (clique de trois sommets). Ce coefficient mesure à quel point le voisinage d’un sommet est connecté.\n\ntransitivity(karate, type = \"global\")\n\n[1] 0.2556818",
    "crumbs": [
      "<span class='chapter-number'>2</span>  <span class='chapter-title'>Indicateurs globaux</span>"
    ]
  },
  {
    "objectID": "mesures.html",
    "href": "mesures.html",
    "title": "3  Mesures locales",
    "section": "",
    "text": "3.1 Centralité de degré\nNombre de liens adjacents à un sommet.\ndegree(karate)\n\n   Mr Hi  Actor 2  Actor 3  Actor 4  Actor 5  Actor 6  Actor 7  Actor 8 \n      16        9       10        6        3        4        4        4 \n Actor 9 Actor 10 Actor 11 Actor 12 Actor 13 Actor 14 Actor 15 Actor 16 \n       5        2        3        1        2        5        2        2 \nActor 17 Actor 18 Actor 19 Actor 20 Actor 21 Actor 22 Actor 23 Actor 24 \n       2        2        2        3        2        2        2        5 \nActor 25 Actor 26 Actor 27 Actor 28 Actor 29 Actor 30 Actor 31 Actor 32 \n       3        3        2        4        3        4        4        6 \nActor 33   John A \n      12       17",
    "crumbs": [
      "<span class='chapter-number'>3</span>  <span class='chapter-title'>Mesures locales</span>"
    ]
  },
  {
    "objectID": "mesures.html#centralité-de-degré",
    "href": "mesures.html#centralité-de-degré",
    "title": "3  Mesures locales",
    "section": "",
    "text": "3.1.1 Degré normalisé\nL’argument normalized permet de calculer la centralité de degré normalisée (degré / (nombre de sommets-1)). Quand on étudie un réseau orienté, l’argument mode permet de calculer le degré entrant (“in”), sortant (“out”) ou les deux (“all”).\n\ndegree(karate, normalized = TRUE, mode = \"all\")\n\n     Mr Hi    Actor 2    Actor 3    Actor 4    Actor 5    Actor 6    Actor 7 \n0.48484848 0.27272727 0.30303030 0.18181818 0.09090909 0.12121212 0.12121212 \n   Actor 8    Actor 9   Actor 10   Actor 11   Actor 12   Actor 13   Actor 14 \n0.12121212 0.15151515 0.06060606 0.09090909 0.03030303 0.06060606 0.15151515 \n  Actor 15   Actor 16   Actor 17   Actor 18   Actor 19   Actor 20   Actor 21 \n0.06060606 0.06060606 0.06060606 0.06060606 0.06060606 0.09090909 0.06060606 \n  Actor 22   Actor 23   Actor 24   Actor 25   Actor 26   Actor 27   Actor 28 \n0.06060606 0.06060606 0.15151515 0.09090909 0.09090909 0.06060606 0.12121212 \n  Actor 29   Actor 30   Actor 31   Actor 32   Actor 33     John A \n0.09090909 0.12121212 0.12121212 0.18181818 0.36363636 0.51515152 \n\n\n\n\n3.1.2 Degré pondéré\nDegré pondéré par l’intensité des liens (attribut weight).\n\nstrength(karate)\n\n   Mr Hi  Actor 2  Actor 3  Actor 4  Actor 5  Actor 6  Actor 7  Actor 8 \n      42       29       33       18        8       14       13       13 \n Actor 9 Actor 10 Actor 11 Actor 12 Actor 13 Actor 14 Actor 15 Actor 16 \n      17        3        8        3        4       17        5        7 \nActor 17 Actor 18 Actor 19 Actor 20 Actor 21 Actor 22 Actor 23 Actor 24 \n       6        3        3        5        4        4        5       21 \nActor 25 Actor 26 Actor 27 Actor 28 Actor 29 Actor 30 Actor 31 Actor 32 \n       7       14        6       13        6       13       11       21 \nActor 33   John A \n      38       48",
    "crumbs": [
      "<span class='chapter-number'>3</span>  <span class='chapter-title'>Mesures locales</span>"
    ]
  },
  {
    "objectID": "mesures.html#distribution-des-degrés",
    "href": "mesures.html#distribution-des-degrés",
    "title": "3  Mesures locales",
    "section": "3.2 Distribution des degrés",
    "text": "3.2 Distribution des degrés\nLa fonction degree.distribution() permet de calculer la fréquence relative des sommets par degré.\n\n# mode = c(\"all\", \"out\", \"in\", \"total\")\n# loops = TRUE/FALSE\n# cumulative = TRUE/FALSE\n\ndegree.distribution(karate)\n\n [1] 0.00000000 0.02941176 0.32352941 0.17647059 0.17647059 0.08823529\n [7] 0.05882353 0.00000000 0.00000000 0.02941176 0.02941176 0.00000000\n[13] 0.02941176 0.00000000 0.00000000 0.00000000 0.02941176 0.02941176\n\n\n\n1ère valeur = fréquence relative des sommets de degré 0\n2ème valeur = fréquence relative des sommets de degré 1\n…\n\nReprésenter la distribution des degrés.\n\nplot(degree.distribution(karate), type=\"b\")\n\n\n\n\n\n\n\n\nAucun sommet ne présente un degré égal à 0, il n’y a donc aucun sommet isolé.",
    "crumbs": [
      "<span class='chapter-number'>3</span>  <span class='chapter-title'>Mesures locales</span>"
    ]
  },
  {
    "objectID": "mesures.html#les-sommets-voisins",
    "href": "mesures.html#les-sommets-voisins",
    "title": "3  Mesures locales",
    "section": "3.3 Les sommets voisins",
    "text": "3.3 Les sommets voisins\nPour connaître les voisins d’un sommets, utiliser la fonction neighbors().\n\nneighbors(karate, v = 1)\n\n+ 16/34 vertices, named, from 4b458a1:\n [1] Actor 2  Actor 3  Actor 4  Actor 5  Actor 6  Actor 7  Actor 8  Actor 9 \n [9] Actor 11 Actor 12 Actor 13 Actor 14 Actor 18 Actor 20 Actor 22 Actor 32\n\n\nPour récupérer la liste des liens vers les sommets voisins, utiliser la fonction incident().\n\nincident(karate, v = 1)\n\n+ 16/78 edges from 4b458a1 (vertex names):\n [1] Mr Hi--Actor 2  Mr Hi--Actor 3  Mr Hi--Actor 4  Mr Hi--Actor 5 \n [5] Mr Hi--Actor 6  Mr Hi--Actor 7  Mr Hi--Actor 8  Mr Hi--Actor 9 \n [9] Mr Hi--Actor 11 Mr Hi--Actor 12 Mr Hi--Actor 13 Mr Hi--Actor 14\n[13] Mr Hi--Actor 18 Mr Hi--Actor 20 Mr Hi--Actor 22 Mr Hi--Actor 32\n\n\nPour savoir si deux sommets sont connectés, utiliser la fonction are.connected().\n\nare.connected(karate, v1 = 1, v2 = 34)\n\n[1] FALSE",
    "crumbs": [
      "<span class='chapter-number'>3</span>  <span class='chapter-title'>Mesures locales</span>"
    ]
  },
  {
    "objectID": "mesures.html#centralité-dintermédiarité",
    "href": "mesures.html#centralité-dintermédiarité",
    "title": "3  Mesures locales",
    "section": "3.4 Centralité d’intermédiarité",
    "text": "3.4 Centralité d’intermédiarité\nElle calcule la proportion de plus courts chemins passant par un sommet donné.\n\nbetweenness(karate, weights = NULL, normalized=TRUE, directed = FALSE)\n\n       Mr Hi      Actor 2      Actor 3      Actor 4      Actor 5      Actor 6 \n0.4737689394 0.0640151515 0.0694128788 0.0025252525 0.0009469697 0.0293560606 \n     Actor 7      Actor 8      Actor 9     Actor 10     Actor 11     Actor 12 \n0.0293560606 0.0000000000 0.0248106061 0.0137941919 0.0009469697 0.0000000000 \n    Actor 13     Actor 14     Actor 15     Actor 16     Actor 17     Actor 18 \n0.0000000000 0.0022727273 0.0000000000 0.0000000000 0.0000000000 0.0304924242 \n    Actor 19     Actor 20     Actor 21     Actor 22     Actor 23     Actor 24 \n0.0056818182 0.2406565657 0.0000000000 0.0000000000 0.0000000000 0.0018939394 \n    Actor 25     Actor 26     Actor 27     Actor 28     Actor 29     Actor 30 \n0.0640782828 0.0009469697 0.0000000000 0.0123106061 0.0191287879 0.0000000000 \n    Actor 31     Actor 32     Actor 33       John A \n0.0056818182 0.1256313131 0.0722222222 0.3967803030 \n\n\nLes arguments normalized et weights permettent de normaliser ou non la centralité d’intermédiarité et d’utiliser ou non le poids des arêtes.",
    "crumbs": [
      "<span class='chapter-number'>3</span>  <span class='chapter-title'>Mesures locales</span>"
    ]
  },
  {
    "objectID": "mesures.html#centralité-de-proximité",
    "href": "mesures.html#centralité-de-proximité",
    "title": "3  Mesures locales",
    "section": "3.5 Centralité de proximité",
    "text": "3.5 Centralité de proximité\nCet indicateur est l’inverse de la somme des distances des plus courts chemins d’un sommet vers tous les autres, il varie entre 0 et 1.\n\ncloseness(karate, weights = NULL, normalized=TRUE, mode = \"all\")\n\n    Mr Hi   Actor 2   Actor 3   Actor 4   Actor 5   Actor 6   Actor 7   Actor 8 \n0.2538462 0.2000000 0.1964286 0.1764706 0.1527778 0.1520737 0.1534884 0.1823204 \n  Actor 9  Actor 10  Actor 11  Actor 12  Actor 13  Actor 14  Actor 15  Actor 16 \n0.1987952 0.1907514 0.1755319 0.1460177 0.2049689 0.1907514 0.1709845 0.1375000 \n Actor 17  Actor 18  Actor 19  Actor 20  Actor 21  Actor 22  Actor 23  Actor 24 \n0.1085526 0.1929825 0.1875000 0.2481203 0.2037037 0.1764706 0.1586538 0.1386555 \n Actor 25  Actor 26  Actor 27  Actor 28  Actor 29  Actor 30  Actor 31  Actor 32 \n0.1578947 0.1235955 0.1692308 0.1563981 0.2024540 0.1746032 0.1736842 0.2088608 \n Actor 33    John A \n0.2000000 0.2519084 \n\n\n\n\n\n\n\n\nA. Calculer les centralités sur chaque composante connexe.\nSi votre réseau n’est pas connexe, il est nécessaire d’utiliser la fonction decompose puis de mesurer les centralités d’intermédiarité et de proximité dans chaque composante. Sinon, le résultat fourni par igraph est aberrant ; attention, il n’y a ni warning ni message d’erreur…\n\nbetweenness(Mes_composantes[[1]], weights = NULL, normalized=TRUE, directed = FALSE)\n\ncloseness(Mes_composantes[[1]], weights = NULL, normalized=TRUE, mode = \"all\")\n\n\n\nB. Mesurer la centralité d’un ou de plusieurs sommets en particulier.\n\n# Par l'index\ndegree(karate)[1]\n\nMr Hi \n   16 \n\n# Par le nom du sommet \nbetweenness(karate, weights=NULL, normalized=TRUE)[\"Mr Hi\"]\n\n    Mr Hi \n0.4737689 \n\n# Sélection multiple\ncloseness(karate, weights=NULL, normalized=TRUE)[c(1,34)]\n\n    Mr Hi    John A \n0.2538462 0.2519084",
    "crumbs": [
      "<span class='chapter-number'>3</span>  <span class='chapter-title'>Mesures locales</span>"
    ]
  },
  {
    "objectID": "mesures.html#transitivité-locale",
    "href": "mesures.html#transitivité-locale",
    "title": "3  Mesures locales",
    "section": "3.6 Transitivité locale",
    "text": "3.6 Transitivité locale\nMesurer la transitivity() locale (par sommet) avec l’argument type.\n\ntransitivity(karate, type = c(\"local\"))\n\n    Mr Hi   Actor 2   Actor 3   Actor 4   Actor 5   Actor 6   Actor 7   Actor 8 \n0.1500000 0.3333333 0.2444444 0.6666667 0.6666667 0.5000000 0.5000000 1.0000000 \n  Actor 9  Actor 10  Actor 11  Actor 12  Actor 13  Actor 14  Actor 15  Actor 16 \n0.5000000 0.0000000 0.6666667       NaN 1.0000000 0.6000000 1.0000000 1.0000000 \n Actor 17  Actor 18  Actor 19  Actor 20  Actor 21  Actor 22  Actor 23  Actor 24 \n1.0000000 1.0000000 1.0000000 0.3333333 1.0000000 1.0000000 1.0000000 0.4000000 \n Actor 25  Actor 26  Actor 27  Actor 28  Actor 29  Actor 30  Actor 31  Actor 32 \n0.3333333 0.3333333 1.0000000 0.1666667 0.3333333 0.6666667 0.5000000 0.2000000 \n Actor 33    John A \n0.1969697 0.1102941 \n\n\n\n\n\n\n\n\nIl n’est pas possible de calculer la transitivité pour les sommets de degré inférieur à deux : par définition, ils ne sont membres d’aucune triade. La fonction renvoie alors la valeur ‘NaN’ (Not a Number).",
    "crumbs": [
      "<span class='chapter-number'>3</span>  <span class='chapter-title'>Mesures locales</span>"
    ]
  },
  {
    "objectID": "mesures.html#relations-entre-indicateurs",
    "href": "mesures.html#relations-entre-indicateurs",
    "title": "3  Mesures locales",
    "section": "3.7 Relations entre indicateurs",
    "text": "3.7 Relations entre indicateurs\nLa fonction plot() permet de visualiser la relation entre deux indicateurs de centralité. Si le graphique suggère une relation linéaire, on peut utiliser la fonction cor.test (corrélation).\n\ndegre &lt;- degree(karate)\ninter &lt;- betweenness(karate)\n\nReprésentation graphique.\n\n# Représentation graphique\nplot(x = degre, y = inter)\ntext(degre, inter, labels = V(karate)$name,cex = 0.7, pos = 2)\n\n\n\n\n\n\n\n\nMesure de la corrélation avec cor.test().\n\n# Méthode Pearson par défaut\ncor.test(degre, inter)\n\n\n    Pearson's product-moment correlation\n\ndata:  degre and inter\nt = 7.2451, df = 32, p-value = 3.128e-08\nalternative hypothesis: true correlation is not equal to 0\n95 percent confidence interval:\n 0.6135820 0.8893245\nsample estimates:\n      cor \n0.7882018 \n\n\nt : valeur de la statistique\ndf : degrés de liberté\np-value : p-value\ncor : coefficient de corrélation (de Pearson dans ce cas).",
    "crumbs": [
      "<span class='chapter-number'>3</span>  <span class='chapter-title'>Mesures locales</span>"
    ]
  },
  {
    "objectID": "mesures.html#les-mesures-comme-attributs",
    "href": "mesures.html#les-mesures-comme-attributs",
    "title": "3  Mesures locales",
    "section": "3.8 Les mesures comme attributs",
    "text": "3.8 Les mesures comme attributs\nIl est possible de transformer les différentes mesures en attributs des sommets et/ou des liens.\n\n# Centralité de degré\nV(karate)$degre &lt;- degree(karate)\n\n# Centralité d'intermediarité\nV(karate)$intermed &lt;- betweenness(karate, weights=NULL, normalized=TRUE)\n  \n# Centralité de proximité\nV(karate)$proximit &lt;- closeness(karate, weights=NULL, normalized=TRUE)\n\n# Transitivité locale\nV(karate)$transit_loc &lt;- transitivity(karate, type = c(\"local\"))\n\nLes sommets ont de nouveaux attributs.",
    "crumbs": [
      "<span class='chapter-number'>3</span>  <span class='chapter-title'>Mesures locales</span>"
    ]
  },
  {
    "objectID": "communaute.html",
    "href": "communaute.html",
    "title": "4  Cliques et communautés",
    "section": "",
    "text": "4.1 Détection de cliques\nUne clique est un sous-graphe maximal complet, c’est-à-dire le plus grand nombre possible de sommets entre lesquels tous les liens possibles sont présents. La fonction clique du package igraph ne prend pas en compte la notion de sous-graphe maximal et fournit par défaut toutes les “cliques” d’ordre 2 (i.e. tous les liens), d’ordre 3 (triades fermées), d’ordre 4, etc. etc. Il est donc recommandé d’utiliser l’argument optionnel min pour indiquer le nombre minimum de sommets devant constituer une clique ; cet argument est fonction de la taille et de la densité du réseau étudié. Par ailleurs, que votre réseau soit ou non orienté, la fonction ne prend pas en compte l’orientation des liens.\nSi l’on cherche des motifs précis (par exemple des sous-graphes maximaux complets d’ordre n), on peut fixer le paramètre max en lui donnant comme argument la même valeur que pour min. Les lignes ci-dessous permettent de récupérer toutes les triades fermées.\n# Lister toutes les cliques de 3 sommets\nCliques_3 &lt;- cliques(karate, min = 3, max = 3)\n\n# Affichage des premières cliques détectées (n = 45)\nhead(Cliques_3, 3) \n\n[[1]]\n+ 3/34 vertices, named, from 4b458a1:\n[1] Mr Hi   Actor 2 Actor 3\n\n[[2]]\n+ 3/34 vertices, named, from 4b458a1:\n[1] Actor 29 Actor 32 John A  \n\n[[3]]\n+ 3/34 vertices, named, from 4b458a1:\n[1] Actor 32 Actor 33 John A\nPour connaître la ou les cliques au sens strict présentes dans le réseau, utilisez la fonction largest_cliques.\n# Cliques \"les plus grandes\"\nCliques_lar &lt;- largest_cliques(karate)\n\n# Affichage \nhead(Cliques_lar) \n\n[[1]]\n+ 5/34 vertices, named, from 4b458a1:\n[1] Actor 2 Mr Hi   Actor 4 Actor 3 Actor 8\n\n[[2]]\n+ 5/34 vertices, named, from 4b458a1:\n[1] Actor 2  Mr Hi    Actor 4  Actor 3  Actor 14",
    "crumbs": [
      "<span class='chapter-number'>4</span>  <span class='chapter-title'>Cliques et communautés</span>"
    ]
  },
  {
    "objectID": "communaute.html#détection-de-communautés",
    "href": "communaute.html#détection-de-communautés",
    "title": "4  Cliques et communautés",
    "section": "4.2 Détection de communautés",
    "text": "4.2 Détection de communautés\nHuit algorithmes de détection de communautés sont implémentés dans igraph :\n\ncluster_edge_betweenness(), basé sur l’intermédiarité des liens ;\n\ncluster_fast_greedy(), optimisant la modularité avec une approche gloutonne (greedy) ;\n\ncluster_walktrap(), basé sur des marches aléatoires ;\n\ncluster_spinglass(), basé sur la recherche de graphes hamiltoniens (graphe possédant au moins un cycle passant par tous les sommets une fois au plus) ;\n\ncluster_leading_eigen(), basé sur les vecteurs propres ;\n\ncluster_label_prop(), basé sur la diffusion entre sommets voisins ;\n\ncluster_infomap(), basé sur des marches aléatoires ;\n\ncluster_louvain(), méthode très utilisée car rapide, basée sur la maximisation locale de la modularité ;\n\ncluster_optimal(), maximisant la modularité (déconseillé pour les gros réseaux).\n\n\n\n\n\n\n\nUn algorithme de partition d’un graphe se choisit en fonction de la structure du réseau : il est peu pertinent de faire de la détection de communautés sur un arbre (réseau acyclique) ou sur un réseau de type centre-périphérie. Un autre critère à prendre en compte est la taille du graphe, certains algorithmes étant inadaptés aux grands graphes. Il est conseillé de tester plusieurs algorithmes pour contrôler la stabilité des communautés détectées.\nIl existe beaucoup d’algorithmes de détection de cliques et communautés. Les différentes méthodes de partitionnement proposées par le package igraph sont expliquées dans ce billet de blog.\n\n\n\ncluster_edge_betweenness() permet par exemple de créer une partition des sommets par déconnexion progressive du graphe, en supprimant les arêtes dans l’ordre décroissant de leur centralité d’intermédiarité.\n\nkarate_cluster_betweness &lt;- cluster_edge_betweenness(karate, weights=NULL)\n\nL’objet renvoyé contient les éléments suivants :\n\nnames(karate_cluster_betweness)\n\n[1] \"removed.edges\"    \"edge.betweenness\" \"merges\"           \"bridges\"         \n[5] \"modularity\"       \"membership\"       \"names\"            \"vcount\"          \n[9] \"algorithm\"       \n\n\nVous pouvez utiliser le $ pour les sélectionner.\nmembership contient la classe d’appartenance de chaque sommet :\n\nkarate_cluster_betweness$membership\n\n [1] 1 1 2 1 3 3 3 1 4 2 3 1 1 2 4 4 3 1 4 1 4 1 4 5 5 5 6 5 2 6 4 4 4 4\n\n\nIl existe différents indicateurs permettant d’évaluer la qualité de la partition obtenue. L’un des plus fréquemment utilisés est la modularité (modularity). Plus cet indicateur est proche de 1, meilleure est la partition obtenue.\n\nmodularity(karate_cluster_betweness)\n\n[1] 0.345299",
    "crumbs": [
      "<span class='chapter-number'>4</span>  <span class='chapter-title'>Cliques et communautés</span>"
    ]
  },
  {
    "objectID": "communaute.html#affichage-des-communautés",
    "href": "communaute.html#affichage-des-communautés",
    "title": "4  Cliques et communautés",
    "section": "4.3 Affichage des communautés",
    "text": "4.3 Affichage des communautés\n\nplot(karate_cluster_betweness, karate, vertex.label=NA)\n\n\n\n\n\n\n\n\nRésultats des différents algorithmes de détection de communautés proposés.",
    "crumbs": [
      "<span class='chapter-number'>4</span>  <span class='chapter-title'>Cliques et communautés</span>"
    ]
  },
  {
    "objectID": "graphique.html",
    "href": "graphique.html",
    "title": "5  Représentation graphique",
    "section": "",
    "text": "5.1 Afficher un objet igraph\nIl est possible d’afficher le graphe avec la fonction plot() ou plot.igraph().\nplot(karate)",
    "crumbs": [
      "<span class='chapter-number'>5</span>  <span class='chapter-title'>Représentation graphique</span>"
    ]
  },
  {
    "objectID": "graphique.html#mise-en-forme",
    "href": "graphique.html#mise-en-forme",
    "title": "5  Représentation graphique",
    "section": "5.2 Mise en forme",
    "text": "5.2 Mise en forme\nUne série d’arguments permet d’améliorer la représentation du graphe. La liste des paramètres graphiques est consultable à ce lien.\nExemple de mise en forme.\n\nplot(karate, \n     vertex.color = \"#198cab\",      # couleur des sommets\n     vertex.frame.color = \"white\",  # couleur des contours des sommets\n     vertex.shape = \"square\",       # forme des sommets\n     vertex.size = 7,               # taille des sommets\n     vertex.label = V(karate)$name, # étiquettes des sommets\n     vertex.label.color = \"grey50\", # couleur des étiquettes des sommets\n     vertex.label.font = 4,         # police des étiquettes des sommets\n     vertex.label.cex = 0.8,        # taille des étiquettes des sommets\n     vertex.label.dist = 2.3,       # distance du label / au centre du sommet\n     vertex.label.degree = 0,       # position / au centre du sommet (0 = droite, \"pi\"= gauche)\n     edge.color = \"goldenrod3\",     # couleur des arêtes\n     edge.curved=.2,                # courbure des arêtes (0 = droit)\n     # arrow.mode = 3,              # type de flèche \n     # edge.arrow.size = 12,        # taille de la pointe de la flèche\n     edge.width = 1,                # largeur des arêtes\n     edge.lty = 3,                  # type de trait (1=plein, 2=pointillés, 3=points...)\n     margin =  c(0,0,0.2,0),             # marges\n     main = graph_attr(karate, \"name\"),  # titre principal\n     sub = graph_attr(karate, \"Author\")) # sous-titre",
    "crumbs": [
      "<span class='chapter-number'>5</span>  <span class='chapter-title'>Représentation graphique</span>"
    ]
  },
  {
    "objectID": "graphique.html#disposition-des-sommets",
    "href": "graphique.html#disposition-des-sommets",
    "title": "5  Représentation graphique",
    "section": "5.3 Disposition des sommets",
    "text": "5.3 Disposition des sommets\n\n5.3.1 Les différents layout\nL’argument layout permet d’utiliser des algorithmes de placement.\n\nQuelques exemples de spatialisation disponibles\n\n\n\n\n\n\n\n\n\nGarder le layout en mémoire dans un objet.\n\nmise_en_page &lt;- layout_on_grid(karate)\n\n# Affichage\nplot(karate, vertex.label=NA, layout = mise_en_page)\n\n\n\n\n\n\n\n\nDéfinir le layout comme un attribut du graphe.\n\nkarate &lt;- set_graph_attr(karate, \"layout\", layout_nicely(karate))\n\n# Affichage\nplot(karate, vertex.label=NA)\n\n\n\n\n\n\n\n\n\n\n5.3.2 layout manuel\nLa fonction tkplot() permet de déplacer les sommets manuellement.\n\n# Ouverture d'une fenêtre graphique dans laquelle on peut déplacer les sommets\ntkid &lt;- tkplot(karate)\n\n\n\n\n\n\n\n\n\n\n\nEnregistrer les nouvelles coordonnées pour les réutiliser.\n\n# Enregistrement des nouvelles coordonnées des sommets\nmy_layout &lt;- tkplot.getcoords(tkid)\n\n# Fermeture de la fenêtre graphique\ntk_close(tkid, window.close = T)\n\n# Plot avec son layout personnalisé\nplot(karate, layout=my_layout)\n\n\n\n\n\n\n\n\n5.3.3 layout “géographique”\n\n\n\n\n\n\nL’exemple présenté ci-dessous a une vocation pédagogique ; les praticiens du club étudié par Wayne Zachary ne s’entraînaient pas en France métropolitaine… Les coordonnées géographiques utilisées sont fictives.\n\n\n\n\n# Vecteur aléatoire de longitude\nV(karate)$longitude &lt;- runif(n=34, min=-1.5, max=6.5)\n\n# Vecteur aléatoire de latitude\nV(karate)$latitude &lt;- runif(n=34, min=43.5, max=49.3)\n\n# Construction d'une matrice de coordonnées\ncoordinates &lt;- cbind(long = V(karate)$longitude, lat = V(karate)$latitude)\n\n# Affichage de la matrice de coordonnées\ncoordinates\n\n             long      lat\n [1,]  1.42113064 47.73486\n [2,]  5.96480321 44.39836\n [3,]  2.10497374 43.73022\n [4,]  0.54860503 44.26117\n [5,]  4.27491789 49.21989\n [6,]  1.17856740 46.47772\n [7,] -0.18428163 46.90998\n [8,] -0.52244396 44.43686\n [9,]  4.82831194 48.75986\n[10,]  4.22143927 43.84328\n[11,]  0.07644341 48.94463\n[12,]  6.11500017 45.24284\n[13,]  3.03276267 47.12556\n[14,] -1.04363533 44.83141\n[15,]  6.46037460 49.05535\n[16,]  5.98279370 44.12507\n[17,]  6.23548726 48.55667\n[18,]  4.34273196 48.77239\n[19,]  6.15768677 46.55151\n[20,]  5.89788893 45.59900\n[21,]  0.51316063 48.04850\n[22,]  1.37916908 45.55000\n[23,]  2.00981773 44.18179\n[24,]  4.82892035 46.97871\n[25,]  5.03716459 46.51508\n[26,]  2.54717794 48.69525\n[27,]  3.52468617 48.70635\n[28,] -0.90100824 48.36429\n[29,]  5.82120703 49.20168\n[30,] -0.92300652 45.03754\n[31,]  2.52150735 49.06622\n[32,]  0.75611757 48.98099\n[33,] -1.18441599 47.58213\n[34,]  4.14728509 49.04028\n\n# Couche géographique des limites de la France métropolitaine\nlibrary(raster)\nfrance &lt;- getData('GADM', country='FRA', level=0)\n\n# Affichage du fond de carte\nplot(france, lwd=0.2)\n\n# Affichage du graphe\nplot(karate, layout = coordinates, rescale = FALSE,\n     vertex.label = NA, main = \"igraph dans l'espace\", add = TRUE)\n\n\n\n\n\n\n\n\n\n\n\n\n\n\nAttention, cette méthode fonctionne uniquement avec des latitudes et longitudes et pas avec des coordonnées projetées.",
    "crumbs": [
      "<span class='chapter-number'>5</span>  <span class='chapter-title'>Représentation graphique</span>"
    ]
  },
  {
    "objectID": "graphique.html#les-attributs-graphiques",
    "href": "graphique.html#les-attributs-graphiques",
    "title": "5  Représentation graphique",
    "section": "5.4 Les attributs graphiques",
    "text": "5.4 Les attributs graphiques\nCertains paramètres graphiques peuvent être renseignés comme attributs des vertices et des edges. C’est par exemple le cas pour les attributs :\n\ncolor (vertices et edges)\n\nsize (vertices)\n\nshape (vertices)\n\nframe.color (vertices)\n\nframe.width (vertices)\nlabel (vertices)\nlabel.color (vertices)\n\nwidth (edges)\n\n…\n\nLa liste des attributs-paramètres graphiques est indiquée sur cette page.\n\n# vertex.color = couleur des sommets\nV(karate)$color  &lt;- V(karate)$Faction\n\n# vertex.frame.color = couleur de la bordure des sommets\nV(karate)$frame.color &lt;- V(karate)$Faction\n\n# vertex.size = taille des sommets\nV(karate)$size  &lt;- degree(karate)\n\n# edge.width = largeur des arêtes\nE(karate)$width  &lt;- E(karate)$weight\n\nplot(karate, vertex.label = NA, \n     main = \"Paramètres graphiques comme attributs\") \n\n\n\n\n\n\n\n\nDéfinir une forme en fonction des modalités d’un attribut avec ifelse.\n\n# Création d'une nouvelle variable \"position\"\nV(karate)$position &lt;-  c(\"Maître\", \"Élève\", \"Élève\", \"Élève\", \"Élève\", \"Élève\",\n                         \"Élève\", \"Élève\", \"Élève\",  \"Élève\", \"Élève\", \"Élève\", \n                         \"Élève\", \"Élève\", \"Élève\", \"Élève\", \"Élève\", \"Élève\", \n                         \"Élève\", \"Élève\", \"Élève\", \"Élève\", \"Élève\", \"Élève\", \n                         \"Élève\", \"Élève\", \"Élève\", \"Élève\", \"Élève\", \"Élève\", \n                         \"Élève\", \"Élève\", \"Élève\", \"Maître\")\n\n# vertex.shape = forme des sommets\nV(karate)$shape &lt;- ifelse(V(karate)$position %in% \"Élève\", \"square\",\n                          ifelse(V(karate)$position %in% \"Maître\", \"circle\",\"none\"))        \n\n\n\n\n\n\n\n\n\n\nDéfinir une forme en fonction des modalités d’un attribut en utilisant un factor.\n\n# Détection de communauté\n# Algorithme de clustering (3 classes demandées)\ncom_karate &lt;- cluster_spinglass(karate, spins=3)\n\n# Communauté d'appartenance comme attribut des noeuds\nV(karate)$membership &lt;- com_karate$membership\n\n# Choix de couleurs personnalisé\ncolrs &lt;- c(\"red2\",\"darkgoldenrod1\",\"olivedrab3\")\nV(karate)$color  &lt;- colrs[as.factor(V(karate)$membership)]",
    "crumbs": [
      "<span class='chapter-number'>5</span>  <span class='chapter-title'>Représentation graphique</span>"
    ]
  },
  {
    "objectID": "graphique.html#ajouter-une-légende",
    "href": "graphique.html#ajouter-une-légende",
    "title": "5  Représentation graphique",
    "section": "5.5 Ajouter une légende",
    "text": "5.5 Ajouter une légende\n\nplot(karate, \n     vertex.label = NA, \n     vertex.size = 9,\n     layout = layout_nicely, \n     main = \"Ajouter une légende\")  \n\nlegend(x = -1.2, y = 1,\n       legend = levels(as.factor(V(karate)$position)),\n       pch = c(22, 21),\n       pt.cex=2,\n       bty=\"o\",\n       title = \"Position\")\n\nlegend(x = 0.95, y = -0.65,\n       legend = levels(as.factor(V(karate)$membership)),\n       pch=20,\n       col= colrs,\n       pt.cex=3,\n       bty=\"o\",\n       title = \"Cluster\")\n\n\n\n\n\n\n\n\n\n\n\n\n\n\nIl est actuellement compliqué de construire une légende pour les symboles proportionnels (sommets et liens), il existe néanmoins des solutions…\n\n\n\nLes sommets d’un objet igraph sont par défaut représentés sur un repère orthonormé étendu de -1 à 1 sur l’axe des abscisses et des ordonnées.",
    "crumbs": [
      "<span class='chapter-number'>5</span>  <span class='chapter-title'>Représentation graphique</span>"
    ]
  },
  {
    "objectID": "graphique.html#représenter-la-matrice-dadjacence",
    "href": "graphique.html#représenter-la-matrice-dadjacence",
    "title": "5  Représentation graphique",
    "section": "5.6 Représenter la matrice d’adjacence",
    "text": "5.6 Représenter la matrice d’adjacence\nComme tous les logiciels d’analyse de réseau, igraph privilégie la représentation dite lien - noeud. Il est possible d’utiliser d’autres modes de représentation, comme par exemple la forme matricielle. Cependant, dans la mesure où la matrice d’adjacence n’est pas soumise à un algorithme de réordonnancement, ce mode de représentation n’est pas nécessairement plus lisible.\n\n# Matrice d'adjacence\nmat &lt;- as_adjacency_matrix(karate, attr=\"weight\", sparse=FALSE)\n\n# Noms de colonnes et lignes de la matrice\ncolnames(mat) &lt;- V(karate)$name\nrownames(mat) &lt;- V(karate)$name\n\n# Représentation matricielle\nheatmap(mat[,34:1], Rowv = NA, Colv = NA, scale=\"none\", margins=c(5,5))",
    "crumbs": [
      "<span class='chapter-number'>5</span>  <span class='chapter-title'>Représentation graphique</span>"
    ]
  },
  {
    "objectID": "conclusion.html",
    "href": "conclusion.html",
    "title": "Conclusion",
    "section": "",
    "text": "Infos session\nsessionInfo()\n\nR version 4.4.1 (2024-06-14)\nPlatform: x86_64-pc-linux-gnu\nRunning under: Ubuntu 22.04.4 LTS\n\nMatrix products: default\nBLAS:   /usr/lib/x86_64-linux-gnu/openblas-pthread/libblas.so.3 \nLAPACK: /usr/lib/x86_64-linux-gnu/openblas-pthread/libopenblasp-r0.3.20.so;  LAPACK version 3.10.0\n\nlocale:\n [1] LC_CTYPE=fr_FR.UTF-8       LC_NUMERIC=C              \n [3] LC_TIME=fr_FR.UTF-8        LC_COLLATE=fr_FR.UTF-8    \n [5] LC_MONETARY=fr_FR.UTF-8    LC_MESSAGES=fr_FR.UTF-8   \n [7] LC_PAPER=fr_FR.UTF-8       LC_NAME=C                 \n [9] LC_ADDRESS=C               LC_TELEPHONE=C            \n[11] LC_MEASUREMENT=fr_FR.UTF-8 LC_IDENTIFICATION=C       \n\ntime zone: Europe/Paris\ntzcode source: system (glibc)\n\nattached base packages:\n[1] stats     graphics  grDevices utils     datasets  methods   base     \n\nloaded via a namespace (and not attached):\n [1] htmlwidgets_1.6.4 compiler_4.4.1    fastmap_1.1.1     cli_3.6.2        \n [5] tools_4.4.1       htmltools_0.5.8.1 rstudioapi_0.16.0 rmarkdown_2.26   \n [9] knitr_1.46        jsonlite_1.8.8    xfun_0.43         digest_0.6.35    \n[13] rlang_1.1.3       evaluate_0.23",
    "crumbs": [
      "Conclusion"
    ]
  },
  {
    "objectID": "exercice.html",
    "href": "exercice.html",
    "title": "Exercice",
    "section": "",
    "text": "Données\nLes données et le corrigé de cet exercice sont mis à disposition via un projet RStudio :\nDécompressez le dossier. Deux fichiers .csv sont à votre disposition dans le sous-répertoire data :\nIl s’agit de données de mobilités scolaires 2017 entre communes des Bouches du Rhône (réseau unimodal, orienté, valué et pouvant être cartographié pour les plus géographes d’entre nous…). La table som13 contient des attributs socio-démographiques de l’Insee. Le dictionnaire des variables est disponible ici : https://www.insee.fr/fr/statistiques/2521169#dictionnaire.\nSource : https://www.insee.fr/fr/statistiques/2521169#consulter",
    "crumbs": [
      "Exercice"
    ]
  },
  {
    "objectID": "exercice.html#données",
    "href": "exercice.html#données",
    "title": "Exercice",
    "section": "",
    "text": "Télécharger le projet Rstudio\n\n\n\n\ndata/liens_d13.csv : table de liens ;\ndata/som13.csv, table de sommets.",
    "crumbs": [
      "Exercice"
    ]
  },
  {
    "objectID": "exercice.html#questions",
    "href": "exercice.html#questions",
    "title": "Exercice",
    "section": "Questions",
    "text": "Questions\nLes points d’interrogation en début de ligne indiquent une fonction manquante. Les solutions se trouvent :\n\ndans le support ;\ndans la documentation du package ;\ndans le fichier exercice_corrige.R.\n\n\n1. Charger la bibliothèque\n\ninstall.packages()\n\nlibrary()\n\n\n\nSolution\n# install.packages(\"igraph\")\nlibrary(igraph)\n\n\n\n\n2. Importer le tableau des sommets et des liens\n\nread.csv()\n\nread.csv2()\n\n\n\nSolution\n# Import des liens\nlien &lt;- read.csv2(\"data/liens_d13.csv\", header = TRUE)\n\n# Import de la table des sommets\nsom &lt;- read.csv(\"data/som13.csv\", sep = \" \", header = TRUE)\n\n\n\n\n3. Construire un objet igraph à partir de ces tableaux\n\ngraph_from_data_frame()\n\n\n\nSolution\n# Transformation en objet igraph\ng13 &lt;- graph_from_data_frame(lien, som, directed = TRUE)\n\n# Examen de l'objet\ng13\n\n# Que signifie DNW ?\n# Directed, Named, Weighted\n\n\n\n\n4. Visualiser le graphe\n\n\nSolution\n# Visualisation par défaut\nplot(g13)\n\n\n\n\n5. Ordre et taille du graphe\n\nvcount()\n\necount()\n\n\n\nSolution\n# Ordre (nombre de sommets)\nvcount(g13)\n\n# Taille (nombre de liens)\necount(g13)\n\n\n\n\n6. Supprimer les sommets isolés\n\n\nSolution\n# Suppression des isolés\ng13 &lt;- delete.vertices(g13, degree(g13) &lt; 1)\n\n# Visualisation \nplot(g13, \n     edge.arrow.size = 0.5,\n     vertex.size = 5,\n     vertex.label = NA)\n\n\n\n\n7. Explorer les composantes\n\n\nSolution\n# Décompose composantes connexes\nc13 &lt;- decompose(g13)\n\nsummary(c13)\n\n# Extraction et analyse de la plus grande composante\ng &lt;- c13[[1]]\n\nplot(g, \n     vertex.label = NA, \n     edge.arrow.size = 0.2, \n     vertex.color = \"red\", \n     vertex.size = degree(g, mode = c(\"all\")))\n\n\n\n\n8. Fixer des paramètres\n\n\nSolution\n# Couleur des sommets\nV(g)$color &lt;- \"red\"\n\n# Taille des sommets\nV(g)$size &lt;- 5\n\n\n\n\n9. Calculer des indicateurs et mesurer leur relation\n\nDiamètre du graphe\nDistribution de l’intensité des liens\nProportion des liens mutuels et asymétriques\n\n\n\nSolution\n# Diamètre du réseau\ndiameter(g)\n\n# Diamètre topologique\ndiameter(g,  weights = NA)\n\n# Distribution de l'intensité des liens\nsummary(E(g)$weight)\n\n# Ne conserver que les liens &gt; x\n# g &lt;- delete.edges(g, which (E(g)$weight &lt; x))\n\n# Proportion de liens mutuels et asymétriques\ndyad.census(g)\n\n\n\n\n10. Relations entre centralités\nCalcul des différents indicateurs de centralité.\n\n\nSolution\n# degré entrant pondéré\ndegin_w &lt;- strength(g, mode = c(\"in\")) \n\n# degré sortant pondéré\ndegou_w  &lt;- strength(g, mode = c(\"out\")) \n\n# degré entrant \ndegin &lt;- degree(g, mode = c(\"in\")     \n\n# degré sortant\ndegou &lt;- degree(g, mode =c(\"out\"))  \n\n# degré total\ndeg &lt;- degree(g, mode = c(\"all\"))\n\n# intermédiarité\nbet &lt;-betweenness(g)          \n\n# proximité\nclo &lt;- closeness(g, mode= c(\"all\"))       \n\n\nLes communes qui émettent le plus d’élèves sont-elles celles qui en reçoivent le plus ?\n\n\nSolution\nplot(degou_w, degin_w)    \n\n\nEt si on raisonne en nombre de communes et non en volume d’enfants ?\n\n\nSolution\nplot(degou, degin)   \n\n\nLes communes ayant le degré le plus élevé ont-elles aussi une forte intermédiarité ? une closeness faible ?\n\n\nSolution\nplot(deg, bet)\nplot(deg, clo)      \n\n\n\n\n11. Rechercher des cliques\n\n\nSolution\n# Transformation en réseau non orienté\ngno &lt;- as.undirected(g)\n\n# Calcul de la plus grande clique\nlcl &lt;- largest.cliques(gno)  \n\n# Attribuer une couleur unique à tous les sommets\nvcol &lt;- rep(\"red\", vcount(gno))\n\n# Attribuer une autre couleur aux sommets de la plus large clique\nvcol[unlist(lcl)] &lt;- \"gold\"\n\n# Visualisation\nplot(gno, \n     vertex.label=NA, \n     vertex.color=vcol)\n\n\n# Lors de la transformation, on peut ne garder que certains liens pour ne garder \n# que les liens mutuels\n# gmut &lt;- as.undirected(g, mode = c(\"mutual\"))\n\n\n\n\n12. Extraire l’ego-network du premier sommet\n\n\nSolution\n# Calcul de ego Network\negoN &lt;- make_ego_graph(g, order = 1, mode = c(\"all\"))\n\n# Ego network du premier sommet (Aix-en-Provence)\negoN[[1]]\n# V(egoN[[1]])$vertex.label &lt;- V(egoN[[1]])$name\n\nplot(egoN[[1]],\n     # vertex.label = NA,\n     vertex.color = \"red\",\n     edge.arrow.size = 0.1)\n\n\n\n\nBonus 1 : Manipuler un réseau avec boucles et liens multiples\nConstruction d’un réseau avec boucles et liens multiples.\n\ngbm &lt;- d1 &lt;- rbind(c(\"A\",\"A\"),\n                   c(\"A\",\"B\"),\n                   c(\"B\",\"C\"), \n                   c(\"B\",\"C\"), \n                   c(\"B\",\"C\"), \n                   c(\"C\",\"D\"), \n                   c(\"C\",\"D\"))\n\n\n\nCode\ng1 &lt;- graph.data.frame(d1, directed = FALSE)\n\n# Examen de l'objet\ng1\n\n# Tests\nis.loop(g1)\nis.multiple(g1)\n\n# Visualisation par défaut\nplot(g1)\n\n# Centralité de degré\ndegree(g1)\n\n# Par défaut, simplify supprimer boucles et liens multiples\ng1_2 &lt;- simplify(g1)\nplot(g1_2)\n\n# Si je veux garder les liens multiples\ng1_3 &lt;- simplify(g1, remove.multiple = FALSE)\nplot(g1_3)\n\n# Si je veux garder une trace des boucles et des liens multiples\ng1_4 &lt;- simplify_and_colorize(g1)\ng1_4\n\nV(g1_4)$color # il y avait une boucle au premier sommet\nE(g1_4)$color # il y avait 1 lien, 3 liens, 2 liens\n\n\n\n\nBonus 2 : Manipuler un réseau bimodal\nConstruction d’un réseau bimodal.\n\nsom &lt;- c(\"a1\",\"a2\",\"a3\",\"a4\",\"A1\",\"A2\",\"A3\")\nsomtype &lt;- c(FALSE, TRUE, FALSE, TRUE, TRUE, FALSE, FALSE)\ngb &lt;- make_graph(c(\"a1\",\"A1\",\"a2\",\"A1\",\n                     \"a2\",\"A2\",\"a2\",\"A3\",\n                     \"a3\",\"A2\",\"a4\",\"A3\",\n                     \"a4\", \"A2\"), directed = FALSE)\n\n\n# Projection réseau biparti\nV(gb)$type &lt;- somtype\n\n# Visualisation\nplot(gb, layout = layout_as_bipartite(test))\n\n\n\nCode\nV(gb)$color &lt;- \"yellow\"\nV(gb)$size &lt;- 30\nE(gb)$color &lt;- \"black\"\n\n# Projection réseau bimodal\npro &lt;- bipartite.projection(gb)\nE(pro[[1]])$weight\nE(pro[[2]])$weight\n\npar(mfrow=c(1,3))\nplot(gb, layout = layout_as_bipartite(gb))\nplot(pro[[1]], edge.width= E(pro[[1]])$weight) \nplot(pro[[2]], edge.width= E(pro[[2]])$weight)",
    "crumbs": [
      "Exercice"
    ]
  },
  {
    "objectID": "references.html",
    "href": "references.html",
    "title": "Références",
    "section": "",
    "text": "Analyse de réseau avec R",
    "crumbs": [
      "Références"
    ]
  },
  {
    "objectID": "references.html#analyse-de-réseau-avec-r",
    "href": "references.html#analyse-de-réseau-avec-r",
    "title": "Références",
    "section": "",
    "text": "Gabor Csardi, nd, Practical statistical network analysis (with R and igraph)\n\n\nKatherine Ognyanova, 2016, Network Analysis and Visualization with R and igraph\n\n\nKatherine Ognyanova, 2017, Visualisation de réseaux avec R (traduit par LB)\n\n\nJesse Sadle, 2017, Introduction to Network Analysis with R\n\n\n\nSébastien Plutniak, 2018, L’analyse de graphes avec R : un aperçu avec igraph",
    "crumbs": [
      "Références"
    ]
  },
  {
    "objectID": "references.html#analyse-de-réseau-en-shs",
    "href": "references.html#analyse-de-réseau-en-shs",
    "title": "Références",
    "section": "Analyse de réseau en SHS",
    "text": "Analyse de réseau en SHS\n\nFrançois Briatte, depuis 2016, An awesome list of network analysis resources\n\n\nLaurent Beauguitte, 2023, L’analyse de réseau en sciences sociales. Petit guide pratique",
    "crumbs": [
      "Références"
    ]
  }
]