[
  {
    "objectID": "index.html",
    "href": "index.html",
    "title": "my_quarto_book",
    "section": "",
    "text": "Preface\nThis is a Quarto book.\nTo learn more about Quarto books visit https://quarto.org/docs/books.\n\n1 + 1\n\n[1] 2"
  }
]