[
  {
    "objectID": "Partie1.html#introduction",
    "href": "Partie1.html#introduction",
    "title": "Ma partie 1",
    "section": "Introduction",
    "text": "Introduction\nCette partie de ma thèse est sans doute la meilleure , car :\n\nC’est ma directrice qui le dit\nElle n’est pas encore rédigée"
  },
  {
    "objectID": "intro.html",
    "href": "intro.html",
    "title": "Introduction",
    "section": "",
    "text": "This is a book created from markdown and executable code.\nSee Knuth (1984) for additional discussion of literate programming.\n\n1 + 1\n\n[1] 2\n\n\n\n\n\n\nKnuth, Donald E. 1984. « Literate Programming ». Comput. J. 27 (2): 97‑111. https://doi.org/10.1093/comjnl/27.2.97."
  },
  {
    "objectID": "summary.html",
    "href": "summary.html",
    "title": "Summary",
    "section": "",
    "text": "In summary, this book has no content whatsoever.\n\n1 + 1\n\n[1] 2"
  },
  {
    "objectID": "references.html",
    "href": "references.html",
    "title": "References",
    "section": "",
    "text": "Knuth, Donald E. 1984. “Literate Programming.” Comput.\nJ. 27 (2): 97–111. https://doi.org/10.1093/comjnl/27.2.97."
  },
  {
    "objectID": "index.html",
    "href": "index.html",
    "title": "Mon premier quarto book",
    "section": "",
    "text": "Preface\nThis is a Quarto book.\nTo learn more about Quarto books visit https://quarto.org/docs/books.\n\n1 + 1\n\n[1] 2"
  }
]