{
  "<color:#Sienna>@id": "string",
  "name": "string",
  "description": "string",
  "<color:#FireBrick>attributes": [
    {
      "<color:#FireBrick>@id": "string",
      "name": "string",
      "description": "string",
      "type": "string",
      "<color:#Orange>property": {
        "<color:#Orange>@id": "string",
        "name": "string",
        "description": "string",
        "type": "string",
        "uri": ["",""]
      },
      "min": "int",
      "max": "int"
    },
    "<color:#FireBrick><i>(2<sup>ème</sup> attribut)",
    "<color:#FireBrick><i>(3<sup>ème</sup> attribut)",
    "<color:#FireBrick><i>..."
  ],
  "uri": ["<i>http://purl.org/dc/terms/...","<i>..."]
}
