{
    "@context": "https://doi.org/10.5063/schema/codemeta-2.0",
    "@type": "SoftwareSourceCode",
    "license": "https://spdx.org/licenses/AGPL-3.0-or-later",
    "codeRepository": "git+https://gitlab.huma-num.fr/datasphere/heimdall/python.git",
    "contIntegration": "https://gitlab.huma-num.fr/datasphere/heimdall/python/-/pipelines",
    "dateCreated": "2024-07-01",
    "datePublished": "2024-12-24",
    "dateModified": "2024-01-20",
    "downloadUrl": "https://gitlab.huma-num.fr/datasphere/heimdall/python/-/releases",
    "issueTracker": "https://gitlab.huma-num.fr/datasphere/heimdall/python/-/issues",
    "name": "HEIMDALL",
    "version": "1.0.1",
    "identifier": "10.5281/zenodo.12795206",
    "description": "Heimdall is a Python library for easily exporting or migrating between one or more databases formats. It makes a _technical_ no-brainer migration and interoperability between (among others) SQL, CSV, REST APIs and different XML-based DBMS. Additionally, it offers features allowing to improve, update, document and share data without needing to alter the original database.",
    "releaseNotes": "🔖 Version 1.0.1 changelog:\n- rename heimdall.serialize to heimdall.createDatabase\n- move heimdall.createDatabase to heimdall.util.tree.create_empty_tree",
    "developmentStatus": "active",
    "isPartOf": "https://datasphere.readthedocs.io/",
    "referencePublication": "https://doi.org/10.5281/zenodo.10638085",
    "keywords": [ "interoperability", "csv", "xml", "sql", "rest", "python", "research", "hera", "format", "badass" ],
    "programmingLanguage": [ "Python" ],
    "runtimePlatform": [ "Python 3" ],
    "relatedLink": [ "https://datasphere.readthedocs.io/projects/heimdall/" ],
    "author": [
        {
            "@type": "Person",
            "@id": "https://orcid.org/0000-0002-8064-0977",
            "givenName": "Régis",
            "familyName": "Witz",
            "affiliation": {
                "@type": "Organization",
                "name": "CNRS"
            }
        }
    ]
}

