id_query,query
00,#MMreadingMM since:2014-01-01 until:2014-12-31 from:athanorster  
00,#marilyn since:2014-01-01 until:2014-12-31 from:athanorster  
00,#unemarilynparjour since:2014-01-01 until:2014-12-31 from:athanorster  
00,#parlerenmarilyn since:2014-01-01 until:2014-12-31 from:athanorster  
00,#semainier since:2014-01-01 until:2014-12-31 from:athanorster  
00,#marilynalertes since:2014-01-01 until:2014-12-31 from:athanorster  
00,#marilynalert since:2014-01-01 until:2014-12-31 from:athanorster  
00,#marilynmonroe55th since:2014-01-01 until:2014-12-31 from:athanorster  
00,#miltongreene since:2014-01-01 until:2014-12-31 from:athanorster  
00,#monroe since:2014-01-01 until:2014-12-31 from:athanorster  
00,#MMreadingMM since:2015-01-01 until:2015-12-31 from:athanorster  
00,#marilyn since:2015-01-01 until:2015-12-31 from:athanorster  
00,#unemarilynparjour since:2015-01-01 until:2015-12-31 from:athanorster  
00,#parlerenmarilyn since:2015-01-01 until:2015-12-31 from:athanorster  
00,#semainier since:2015-01-01 until:2015-12-31 from:athanorster  
00,#marilynalertes since:2015-01-01 until:2015-12-31 from:athanorster  
00,#marilynalert since:2015-01-01 until:2015-12-31 from:athanorster  
00,#marilynmonroe55th since:2015-01-01 until:2015-12-31 from:athanorster  
00,#miltongreene since:2015-01-01 until:2015-12-31 from:athanorster  
00,#monroe since:2015-01-01 until:2015-12-31 from:athanorster  
00,#MMreadingMM since:2016-01-01 until:2016-12-31 from:athanorster  
00,#marilyn since:2016-01-01 until:2016-12-31 from:athanorster  
00,#unemarilynparjour since:2016-01-01 until:2016-12-31 from:athanorster  
00,#parlerenmarilyn since:2016-01-01 until:2016-12-31 from:athanorster  
00,#semainier since:2016-01-01 until:2016-12-31 from:athanorster  
00,#marilynalertes since:2016-01-01 until:2016-12-31 from:athanorster  
00,#marilynalert since:2016-01-01 until:2016-12-31 from:athanorster  
00,#marilynmonroe55th since:2016-01-01 until:2016-12-31 from:athanorster  
00,#miltongreene since:2016-01-01 until:2016-12-31 from:athanorster  
00,#monroe since:2016-01-01 until:2016-12-31 from:athanorster  
00,#MMreadingMM since:2017-01-01 until:2017-12-31 from:athanorster  
00,#marilyn since:2017-01-01 until:2017-12-31 from:athanorster  
00,#unemarilynparjour since:2017-01-01 until:2017-12-31 from:athanorster  
00,#parlerenmarilyn since:2017-01-01 until:2017-12-31 from:athanorster  
00,#semainier since:2017-01-01 until:2017-12-31 from:athanorster  
00,#marilynalertes since:2017-01-01 until:2017-12-31 from:athanorster  
00,#marilynalert since:2017-01-01 until:2017-12-31 from:athanorster  
00,#marilynmonroe55th since:2017-01-01 until:2017-12-31 from:athanorster  
00,#miltongreene since:2017-01-01 until:2017-12-31 from:athanorster  
00,#monroe since:2017-01-01 until:2017-12-31 from:athanorster  
00,#MMreadingMM since:2018-01-01 until:2018-12-31 from:athanorster  
00,#marilyn since:2018-01-01 until:2018-12-31 from:athanorster  
00,#unemarilynparjour since:2018-01-01 until:2018-12-31 from:athanorster  
00,#parlerenmarilyn since:2018-01-01 until:2018-12-31 from:athanorster  
00,#semainier since:2018-01-01 until:2018-12-31 from:athanorster  
00,#marilynalertes since:2018-01-01 until:2018-12-31 from:athanorster  
00,#marilynalert since:2018-01-01 until:2018-12-31 from:athanorster  
00,#marilynmonroe55th since:2018-01-01 until:2018-12-31 from:athanorster  
00,#miltongreene since:2018-01-01 until:2018-12-31 from:athanorster  
00,#monroe since:2018-01-01 until:2018-12-31 from:athanorster  
00,#MMreadingMM since:2019-01-01 until:2019-12-31 from:athanorster  
00,#marilyn since:2019-01-01 until:2019-12-31 from:athanorster  
00,#unemarilynparjour since:2019-01-01 until:2019-12-31 from:athanorster  
00,#parlerenmarilyn since:2019-01-01 until:2019-12-31 from:athanorster  
00,#semainier since:2019-01-01 until:2019-12-31 from:athanorster  
00,#marilynalertes since:2019-01-01 until:2019-12-31 from:athanorster  
00,#marilynalert since:2019-01-01 until:2019-12-31 from:athanorster  
00,#marilynmonroe55th since:2019-01-01 until:2019-12-31 from:athanorster  
00,#miltongreene since:2019-01-01 until:2019-12-31 from:athanorster  
00,#monroe since:2019-01-01 until:2019-12-31 from:athanorster  
00,#MMreadingMM since:2020-01-01 until:2020-12-31 from:athanorster  
00,#marilyn since:2020-01-01 until:2020-12-31 from:athanorster  
00,#unemarilynparjour since:2020-01-01 until:2020-12-31 from:athanorster  
00,#parlerenmarilyn since:2020-01-01 until:2020-12-31 from:athanorster  
00,#semainier since:2020-01-01 until:2020-12-31 from:athanorster  
00,#marilynalertes since:2020-01-01 until:2020-12-31 from:athanorster  
00,#marilynalert since:2020-01-01 until:2020-12-31 from:athanorster  
00,#marilynmonroe55th since:2020-01-01 until:2020-12-31 from:athanorster  
00,#miltongreene since:2020-01-01 until:2020-12-31 from:athanorster  
00,#monroe since:2020-01-01 until:2020-12-31 from:athanorster  
00,#MMreadingMM since:2021-01-01 until:2021-12-31 from:athanorster  
00,#marilyn since:2021-01-01 until:2021-12-31 from:athanorster  
00,#unemarilynparjour since:2021-01-01 until:2021-12-31 from:athanorster  
00,#parlerenmarilyn since:2021-01-01 until:2021-12-31 from:athanorster  
00,#semainier since:2021-01-01 until:2021-12-31 from:athanorster  
00,#marilynalertes since:2021-01-01 until:2021-12-31 from:athanorster  
00,#marilynalert since:2021-01-01 until:2021-12-31 from:athanorster  
00,#marilynmonroe55th since:2021-01-01 until:2021-12-31 from:athanorster  
00,#miltongreene since:2021-01-01 until:2021-12-31 from:athanorster  
00,#monroe since:2021-01-01 until:2021-12-31 from:athanorster  
00,#MMreadingMM since:2022-01-01 until:2022-12-31 from:athanorster  
00,#marilyn since:2022-01-01 until:2022-12-31 from:athanorster  
00,#unemarilynparjour since:2022-01-01 until:2022-12-31 from:athanorster  
00,#parlerenmarilyn since:2022-01-01 until:2022-12-31 from:athanorster  
00,#semainier since:2022-01-01 until:2022-12-31 from:athanorster  
00,#marilynalertes since:2022-01-01 until:2022-12-31 from:athanorster  
00,#marilynalert since:2022-01-01 until:2022-12-31 from:athanorster  
00,#marilynmonroe55th since:2022-01-01 until:2022-12-31 from:athanorster  
00,#miltongreene since:2022-01-01 until:2022-12-31 from:athanorster  
00,#monroe since:2022-01-01 until:2022-12-31 from:athanorster  
00,#MMreadingMM since:2023-01-01 until:2023-12-31 from:athanorster  
00,#marilyn since:2023-01-01 until:2023-12-31 from:athanorster  
00,#unemarilynparjour since:2023-01-01 until:2023-12-31 from:athanorster  
00,#parlerenmarilyn since:2023-01-01 until:2023-12-31 from:athanorster  
00,#semainier since:2023-01-01 until:2023-12-31 from:athanorster  
00,#marilynalertes since:2023-01-01 until:2023-12-31 from:athanorster  
00,#marilynalert since:2023-01-01 until:2023-12-31 from:athanorster  
00,#marilynmonroe55th since:2023-01-01 until:2023-12-31 from:athanorster  
00,#miltongreene since:2023-01-01 until:2023-12-31 from:athanorster  
00,#monroe since:2023-01-01 until:2023-12-31 from:athanorster
